Error when setting up gradle

Started by Samueles1000 on Tue, 07/12/2022 - 11:20

Topic category: Help with MCreator software

Last seen on 11:43, 12. Jul 2022
Joined Jul 2022
Points:

User statistics:

  • Modifications:
  • Forum topics:
  • Wiki pages:
  • Tracker tickets:
  • MCreator plugins:
  • Comments:
Error when setting up gradle
Tue, 07/12/2022 - 11:20

Executing Gradle task: eclipse
Build info: MCreator 2022.1.20510, forge-1.16.5, 64-bit, 12208 MB, Windows 10, JVM 17.0.1, JAVA_HOME: C:\Program Files\Pylo\MCreator\jdk, started on: 2022-07-12-18:09:54
 
FAILURE: Build failed with an exception.
* What went wrong:
A problem occurred configuring root project 'world_of_warcraft'.
> Could not resolve all artifacts for configuration ':classpath'.
 > Could not download fastutil-8.3.1.jar (it.unimi.dsi:fastutil:8.3.1)
  > Could not get resource 'https://maven.minecraftforge.net/it/unimi/dsi/fastutil/8.3.1/fastutil-8…'.
  > Premature end of Content-Length delimited message body (expected: 19,011,744; received: 18,327,824)
* Try:
Run with --stacktrace option to get the stack trace. Run with --info or --debug option to get more log output. Run with --scan to get full insights.
* Get more help at https://help.gradle.org
BUILD FAILED in 5m 40s
 
BUILD FAILED
Task completed in 5 minutes and 40 seconds

 

 

The erorr i got, any fix?