Fix this please, I made plugin for MCreator (APIs)

Started by InfoyPSYT on

Topic category: Plugins and third-party tools

Last seen on 13:42, 24. Jun 2024
Joined Jun 2022
Points:

User statistics:

  • Modifications:
  • Forum topics:
  • Wiki pages:
  • MCreator plugins:
  • Comments:
Fix this please, I made plugin for MCreator (APIs)

Actually I made a plugin for MCreator which adds many mods as APIs for Fabric. 

Everything works but when I enable 'PerfMods' which stands for Performance mods containing these mods (Also, when I enable PerfMods, it says "Gradle is not connected to internet" but if I disable, everything works fine and also I use Ethernet not Wireless WiFi):

  •  Sodum
  •  Lithium
  • ImmediatelyFast
  • TooltipFix
     

Here's the log (I guess Sodium is having issues, that's why I made my own repo and uploaded latest Sodium Fabric version but this still doesn't to work):

Executing Gradle task: --info
Build info: MCreator 2023.4.52316, fabric-1.20.1, 64-bit, 8048 MB, Windows 10, JVM 17.0.9, JAVA_HOME: C:\Program Files\Pylo\MCreator\jdk, started on: 2024-02-22-17:40:29
Loaded APIs: mouse_tweaks, enchantment_descriptions, wthit, continuity_requires_indium, perfmods, indium_required_for_most_mods, appleskin, clumps, apimods, polymorph, jei, emi_requires_jei

The client will now receive all logging from the daemon (pid: 8480). The daemon log file: C:\Users\Prabhesh\.mcreator\gradle\daemon\8.3\daemon-8480.out.log
Starting 3rd build in daemon [uptime: 14 mins 18.419 secs, performance: 100%, GC rate: 0.00/s, heap usage: 1% of 3 GiB]
Closing daemon's stdin at end of input.
The daemon will no longer process any standard input.
Using 8 worker leases.
Now considering [C:\Users\Prabhesh\MCreatorWorkspaces\creators_essentials_testws] as hierarchies to watch
Watching the file system is configured to be enabled if available
File system watching is active
Starting Build
Settings evaluated using settings file 'C:\Users\Prabhesh\MCreatorWorkspaces\creators_essentials_testws\settings.gradle'.
Projects loaded. Root project using build file 'C:\Users\Prabhesh\MCreatorWorkspaces\creators_essentials_testws\build.gradle'.
Included projects: [root project 'creators_essentials_testws']
> Configure project :
Evaluating root project 'creators_essentials_testws' using build file 'C:\Users\Prabhesh\MCreatorWorkspaces\creators_essentials_testws\build.gradle'.
The configuration detachedConfiguration1 is both resolvable and consumable. This is considered a legacy configuration and it will eventually only be possible to be one of these.
The configuration detachedConfiguration1 is both consumable and declarable. This combination is incorrect, only one of these flags should be set.
The configuration detachedConfiguration1 is both resolvable and consumable. This is considered a legacy configuration and it will eventually only be possible to be one of these.
The configuration detachedConfiguration1 is both consumable and declarable. This combination is incorrect, only one of these flags should be set.
The configuration :classpath is both resolvable and consumable. This is considered a legacy configuration and it will eventually only be possible to be one of these.
The configuration :classpath is both consumable and declarable. This combination is incorrect, only one of these flags should be set.
The configuration :classpath is both resolvable and consumable. This is considered a legacy configuration and it will eventually only be possible to be one of these.
The configuration :classpath is both consumable and declarable. This combination is incorrect, only one of these flags should be set.
Fabric Loom: 1.4.6
(kotlinx.metadata.jvm.KotlinClassMetadata) with version (0.7.0-1.9.0-31) was loaded from (/C:/Users/Prabhesh/.mcreator/gradle/caches/modules-2/files-2.1/org.jetbrains.kotlinx/kotlinx-metadata-jvm/0.7.0/babbf7cbcd7083709bf27ee5e19dd558d2dea39b/kotlinx-metadata-jvm-0.7.0.jar)
(org.objectweb.asm.ClassVisitor) with version (9.5) was loaded from (/C:/Users/Prabhesh/.mcreator/gradle/caches/modules-2/files-2.1/org.ow2.asm/asm/9.5/dc6ea1875f4d64fbc85e1691c95b96a3d8569c90/asm-9.5.jar)
(org.objectweb.asm.tree.analysis.Analyzer) with version (9.5) was loaded from (/C:/Users/Prabhesh/.mcreator/gradle/caches/modules-2/files-2.1/org.ow2.asm/asm-analysis/9.5/490bacc77de7cbc0be1a30bb3471072d705be4a4/asm-analysis-9.5.jar)
(org.objectweb.asm.commons.ClassRemapper) with version (9.5) was loaded from (/C:/Users/Prabhesh/.mcreator/gradle/caches/modules-2/files-2.1/org.ow2.asm/asm-commons/9.5/19ab5b5800a3910d30d3a3e64fdb00fd0cb42de0/asm-commons-9.5.jar)
(org.objectweb.asm.tree.ClassNode) with version (9.5) was loaded from (/C:/Users/Prabhesh/.mcreator/gradle/caches/modules-2/files-2.1/org.ow2.asm/asm-tree/9.5/fd33c8b6373abaa675be407082fdfda35021254a/asm-tree-9.5.jar)
(org.objectweb.asm.util.ASMifier) with version (9.5) was loaded from (/C:/Users/Prabhesh/.mcreator/gradle/caches/modules-2/files-2.1/org.ow2.asm/asm-util/9.5/64b5a1fc8c1b15ed2efd6a063e976bc8d3dc5ffe/asm-util-9.5.jar)
(com.fasterxml.jackson.databind.ObjectMapper) with version (2.15.2) was loaded from (/C:/Users/Prabhesh/.mcreator/gradle/caches/modules-2/files-2.1/com.fasterxml.jackson.core/jackson-databind/2.15.2/9353b021f10c307c00328f52090de2bdb4b6ff9c/jackson-databind-2.15.2.jar)
(com.google.gson.Gson) with version (null) was loaded from (/C:/Users/Prabhesh/.mcreator/gradle/caches/modules-2/files-2.1/com.google.code.gson/gson/2.10.1/b3add478d4382b78ea20b1671390a858002feb6c/gson-2.10.1.jar)
(com.google.common.base.Preconditions) with version (null) was loaded from (/C:/Users/Prabhesh/.mcreator/gradle/caches/modules-2/files-2.1/com.google.guava/guava/32.1.2-jre/5e64ec7e056456bef3a4bc4c6fdaef71e8ab6318/guava-32.1.2-jre.jar)
(org.apache.commons.io.FileUtils) with version (2.13.0) was loaded from (/C:/Users/Prabhesh/.mcreator/gradle/caches/modules-2/files-2.1/commons-io/commons-io/2.13.0/8bb2bc9b4df17e2411533a0708a69f983bf5e83b/commons-io-2.13.0.jar)
Creating new SharedServiceManager(1593943665)
Creating new SharedServiceManager(1556436524)
Found existing cache lock file, rebuilding loom cache. This may have been caused by a failed or canceled build.
:merging jars
:Extracting server jar from bootstrap
Creating new SharedServiceManager(471319910)
Downloading intermediary from https://maven.fabricmc.net/net/fabricmc/intermediary/1.20.1/intermediary-1.20.1-v2.jar
Closing SharedServiceManager(471319910)
~~~~~~~~~~~~~~~~~~~~~~~~~~~~~~~~~~~~~~~~~~~~~~~~~~~~~~~~~~~~~~
Using of the official minecraft mappings is at your own risk!
Please make sure to read and understand the following license:
~~~~~~~~~~~~~~~~~~~~~~~~~~~~~~~~~~~~~~~~~~~~~~~~~~~~~~~~~~~~~~
# (c) 2020 Microsoft Corporation. These mappings are provided "as-is" and you bear the risk of using them. You may copy and use the mappings for development purposes, but you may not redistribute the mappings complete and unmodified. Microsoft makes no warranties, express or implied, with respect to the mappings provided here. Use and modification of this document or the source code (in any form) of Minecraft: Java Edition is governed by the Minecraft End User License Agreement available at https://account.mojang.com/documents/minecraft_eula.
~~~~~~~~~~~~~~~~~~~~~~~~~~~~~~~~~~~~~~~~~~~~~~~~~~~~~~~~~~~~~~
:extracting loom.mappings-layered+hash.2198.tiny
Downloading intermediary from https://maven.fabricmc.net/net/fabricmc/intermediary/1.20.1/intermediary-1.20.1-v2.jar
:merging mappings
:merged mappings in 255.9 ms
The configuration :mainSourceElements is both consumable and declarable. This combination is incorrect, only one of these flags should be set.
The configuration :sourcesElements is both consumable and declarable. This combination is incorrect, only one of these flags should be set.
Resource missing. [HTTP GET: https://maven.fabricmc.net/com/github/PSGitHubUser1/sodium-latest-dev/mc1.20.1-0.5.8/sodium-latest-dev-mc1.20.1-0.5.8.pom]
Resource missing. [HTTP GET: https://libraries.minecraft.net/com/github/PSGitHubUser1/sodium-latest-dev/mc1.20.1-0.5.8/sodium-latest-dev-mc1.20.1-0.5.8.pom]
Resource missing. [HTTP HEAD: https://libraries.minecraft.net/com/github/PSGitHubUser1/sodium-latest-dev/mc1.20.1-0.5.8/sodium-latest-dev-mc1.20.1-0.5.8.jar]
Resource missing. [HTTP GET: https://repo.maven.apache.org/maven2/com/github/PSGitHubUser1/sodium-latest-dev/mc1.20.1-0.5.8/sodium-latest-dev-mc1.20.1-0.5.8.pom]
Resource missing. [HTTP GET: https://jitpack.io/com/github/PSGitHubUser1/sodium-latest-dev/mc1.20.1-0.5.8/sodium-latest-dev-mc1.20.1-0.5.8.pom]
Resource missing. [HTTP GET: https://maven.fabricmc.net/com/github/PSGitHubUser1/sodium-latest-dev/mc1.20.1-0.5.8/sodium-latest-dev-mc1.20.1-0.5.8.pom]
Closing SharedServiceManager(1556436524)
FAILURE: Build failed with an exception.
* What went wrong:
A problem occurred configuring root project 'creators_essentials_testws'.
> Could not resolve all files for configuration ':modImplementation'.
> Could not find com.github.PSGitHubUser1:sodium-latest-dev:mc1.20.1-0.5.8.
Searched in the following locations:
- file:/C:/Users/Prabhesh/MCreatorWorkspaces/creators_essentials_testws/.gradle/loom-cache/remapped_mods/com/github/PSGitHubUser1/sodium-latest-dev/mc1.20.1-0.5.8/sodium-latest-dev-mc1.20.1-0.5.8.pom
- file:/C:/Users/Prabhesh/.mcreator/gradle/caches/fabric-loom/minecraftMaven/com/github/PSGitHubUser1/sodium-latest-dev/mc1.20.1-0.5.8/sodium-latest-dev-mc1.20.1-0.5.8.pom
- file:/C:/Users/Prabhesh/MCreatorWorkspaces/creators_essentials_testws/.gradle/loom-cache/minecraftMaven/com/github/PSGitHubUser1/sodium-latest-dev/mc1.20.1-0.5.8/sodium-latest-dev-mc1.20.1-0.5.8.pom
- https://maven.fabricmc.net/com/github/PSGitHubUser1/sodium-latest-dev/mc1.20.1-0.5.8/sodium-latest-dev-mc1.20.1-0.5.8.pom
- https://libraries.minecraft.net/com/github/PSGitHubUser1/sodium-latest-dev/mc1.20.1-0.5.8/sodium-latest-dev-mc1.20.1-0.5.8.pom
- https://libraries.minecraft.net/com/github/PSGitHubUser1/sodium-latest-dev/mc1.20.1-0.5.8/sodium-latest-dev-mc1.20.1-0.5.8.jar
- https://repo.maven.apache.org/maven2/com/github/PSGitHubUser1/sodium-latest-dev/mc1.20.1-0.5.8/sodium-latest-dev-mc1.20.1-0.5.8.pom
- https://jitpack.io/com/github/PSGitHubUser1/sodium-latest-dev/mc1.20.1-0.5.8/sodium-latest-dev-mc1.20.1-0.5.8.pom
Required by:
project :
* Try:
> Run with --stacktrace option to get the stack trace.
> Run with --debug option to get more log output.
> Run with --scan to get full insights.
> Get more help at https://help.gradle.org.
BUILD FAILED in 13s
Watched directory hierarchies: []

BUILD FAILED
Task completed in 16 seconds 

Please help me, how do I solve this issue.

It seems you are using…
Fri, 02/23/2024 - 14:21

It seems you are using fabric plugin, so best would be to get in touch with the author of this plugin