I can't Export my mod or run the test file

Started by UltraDiamondKing on Mon, 11/23/2015 - 15:25
Last seen on 14:28, 20. Apr 2018
Joined Nov 2015
User points:

Statistics:

  • Comments:
  • Forum topics:
  • Modifications:
  • Wiki pages:
I can't Export my mod or run the test file
Mon, 11/23/2015 - 15:25

when i try to export or run the test version of minecraft trough MCCreator it crashes 

can anyone help me with this problem?

if you could do that it would be GREAT!!! :D 

Last seen on 13:46, 28. Nov 2015
Joined Jul 2015
User points:

Statistics:

  • Comments:
  • Forum topics:
  • Modifications:
  • Wiki pages:
I have this problem too, with
Sat, 11/28/2015 - 13:49

I have this problem too, with this in the log:

BOOTING UP GRADLE...
Data loaded, MCreator gradle console ready [ver 1.007]! [boot took 14 milliseconds]
RIGHT click once to copy log to the clipboard or twice to clear the log.
   
Executing gradle command: clean runClient
sudo: no tty present and no askpass program specified
Task completed with return code 1 in 76 milliseconds

 

Last seen on 01:06, 24. Mar 2017
Joined Nov 2015
User points:

Statistics:

  • Comments:
  • Forum topics:
  • Modifications:
  • Wiki pages:
Having the same problem!
Sat, 11/28/2015 - 15:10

Having the same problem!

Last seen on 14:52, 10. Jan 2016
Joined Nov 2015
User points:

Statistics:

  • Comments:
  • Forum topics:
  • Modifications:
  • Wiki pages:
go to "forge/.gradle/" and
Sat, 11/28/2015 - 15:15

go to "forge/.gradle/" and there will be a ".properties.lock" or something like that. remove the ".lock"

Last seen on 01:06, 24. Mar 2017
Joined Nov 2015
User points:

Statistics:

  • Comments:
  • Forum topics:
  • Modifications:
  • Wiki pages:
RE:go to "forge/.gradle/" and
Sat, 11/28/2015 - 15:51

@#3 No, there isnt any file like that or a .gradle folder even.

Last seen on 01:58, 24. Dec 2016
Joined Nov 2015
User points:

Statistics:

  • Comments:
  • Forum topics:
  • Modifications:
  • Wiki pages:
The same thing is happening
Sat, 11/28/2015 - 20:35

The same thing is happening to me and i fixed the lock file it says theres a problem with compileJava but i checked and it says there arent any mods with compilation errors

Last seen on 11:14, 5. Jun 2016
Joined May 2016
User points:

Statistics:

  • Comments:
  • Forum topics:
  • Modifications:
  • Wiki pages:
please tell me how fix this  
Tue, 05/31/2016 - 12:41

please tell me how fix this  

 

BOOTING UP GRADLE...
Data loaded, MCreator gradle console ready [ver 1.007]! [boot took 1 milliseconds]
RIGHT click once to copy log to the clipboard or twice to clear the log.
   
Executing gradle command: clean runClient
Microsoft Windows [Version 6.1.7600]
Copyright (c) 2009 Microsoft Corporation.  All rights reserved.
D:\MCreator167>cd forge
D:\MCreator167\forge>SET "JAVA_HOME=D:\MCreator167\jdk32\"
'gradlew' is not recognized as an internal or external command,
operable program or batch file.
D:\MCreator167\forge>SET JAVA_EXE=%JAVA_HOME%\bin\java.exe
D:\MCreator167\forge>SET PATH=%JAVA_HOME%\bin\;%PATH%
D:\MCreator167\forge>SET "JAVA_OPTS=-Xmx1024m -Xms512m"
D:\MCreator167\forge>gradlew clean runClient
D:\MCreator167\forge>
Task completed with return code 0 in 119 milliseconds

 

Last seen on 21:46, 3. Jun 2016
Joined May 2016
User points:

Statistics:

  • Comments:
  • Forum topics:
  • Modifications:
  • Wiki pages:
Okay, so I just finished a
Tue, 05/31/2016 - 22:18

Okay, so I just finished a Ore Dimension Mod, but whenever I try to export it to my Local Minecraft to test it, (In tools, there's a button that says 'Export to Local Minecraft') there's a error. MCreator then closes itself. If anybody needs the crash report, i'll try and post it. But can anybody fix it? Because it is my first mod. And I HAVE to have MCreator to work          Here's the error if anybody needs to know.        java.util.zip.ZipException: too many length or distance symbols


    at java.util.zip.InflaterInputStream.read(InflaterInputStream.java:164)
    at java.util.zip.ZipInputStream.read(ZipInputStream.java:193)
    at java.io.FilterInputStream.read(FilterInputStream.java:107)
    at com.google.common.io.ByteStreams.copy(ByteStreams.java:70)
    at com.google.common.io.ByteStreams.toByteArray(ByteStreams.java:115)
    at net.minecraftforge.gradle.common.Constants.hashZip(Constants.java:196)
    at net.minecraftforge.gradle.common.Constants.hash(Constants.java:146)
    at net.minecraftforge.gradle.common.Constants.hashAll(Constants.java:161)
    at net.minecraftforge.gradle.tasks.abstractutil.CachedTask.getHashes(CachedTask.java:204)
    at net.minecraftforge.gradle.tasks.abstractutil.CachedTask.access$500(CachedTask.java:41)
    at net.minecraftforge.gradle.tasks.abstractutil.CachedTask$2.execute(CachedTask.java:179)
    at net.minecraftforge.gradle.tasks.abstractutil.CachedTask$2.execute(CachedTask.java:166)
    at org.gradle.api.internal.AbstractTask$TaskActionWrapper.execute(AbstractTask.java:570)
    at org.gradle.api.internal.AbstractTask$TaskActionWrapper.execute(AbstractTask.java:553)
    at org.gradle.api.internal.tasks.execution.ExecuteActionsTaskExecuter.executeAction(ExecuteActionsTaskExecuter.java:80)
    at org.gradle.api.internal.tasks.execution.ExecuteActionsTaskExecuter.executeActions(ExecuteActionsTaskExecuter.java:61)
    at org.gradle.api.internal.tasks.execution.ExecuteActionsTaskExecuter.execute(ExecuteActionsTaskExecuter.java:46)
    at org.gradle.api.internal.tasks.execution.PostExecutionAnalysisTaskExecuter.execute(PostExecutionAnalysisTaskExecuter.java:35)
    at org.gradle.api.internal.tasks.execution.SkipUpToDateTaskExecuter.execute(SkipUpToDateTaskExecuter.java:64)
    at org.gradle.api.internal.tasks.execution.ValidatingTaskExecuter.execute(ValidatingTaskExecuter.java:58)
    at org.gradle.api.internal.tasks.execution.SkipEmptySourceFilesTaskExecuter.execute(SkipEmptySourceFilesTaskExecuter.java:42)
    at org.gradle.api.internal.tasks.execution.SkipTaskWithNoActionsExecuter.execute(SkipTaskWithNoActionsExecuter.java:52)
    at org.gradle.api.internal.tasks.execution.SkipOnlyIfTaskExecuter.execute(SkipOnlyIfTaskExecuter.java:53)
    at org.gradle.api.internal.tasks.execution.ExecuteAtMostOnceTaskExecuter.execute(ExecuteAtMostOnceTaskExecuter.java:43)
    at org.gradle.api.internal.AbstractTask.executeWithoutThrowingTaskFailure(AbstractTask.java:296)
    at org.gradle.execution.taskgraph.AbstractTaskPlanExecutor$TaskExecutorWorker.executeTask(AbstractTaskPlanExecutor.java:79)
    at org.gradle.execution.taskgraph.AbstractTaskPlanExecutor$TaskExecutorWorker.processTask(AbstractTaskPlanExecutor.java:63)
    at org.gradle.execution.taskgraph.AbstractTaskPlanExecutor$TaskExecutorWorker.run(AbstractTaskPlanExecutor.java:51)
    at org.gradle.execution.taskgraph.DefaultTaskPlanExecutor.process(DefaultTaskPlanExecutor.java:23)
    at org.gradle.execution.taskgraph.DefaultTaskGraphExecuter.execute(DefaultTaskGraphExecuter.java:86)
    at org.gradle.execution.SelectedTaskExecutionAction.execute(SelectedTaskExecutionAction.java:29)
    at org.gradle.execution.DefaultBuildExecuter.execute(DefaultBuildExecuter.java:61)
    at org.gradle.execution.DefaultBuildExecuter.access$200(DefaultBuildExecuter.java:23)
    at org.gradle.execution.DefaultBuildExecuter$2.proceed(DefaultBuildExecuter.java:67)
    at org.gradle.execution.DryRunBuildExecutionAction.execute(DryRunBuildExecutionAction.java:32)
    at org.gradle.execution.DefaultBuildExecuter.execute(DefaultBuildExecuter.java:61)
    at org.gradle.execution.DefaultBuildExecuter.execute(DefaultBuildExecuter.java:54)
    at org.gradle.initialization.DefaultGradleLauncher.doBuildStages(DefaultGradleLauncher.java:148)
    at org.gradle.initialization.DefaultGradleLauncher.doBuild(DefaultGradleLauncher.java:105)
    at org.gradle.initialization.DefaultGradleLauncher.run(DefaultGradleLauncher.java:85)
    at org.gradle.launcher.exec.InProcessBuildActionExecuter$DefaultBuildController.run(InProcessBuildActionExecuter.java:81)
    at org.gradle.launcher.cli.ExecuteBuildAction.run(ExecuteBuildAction.java:33)
    at org.gradle.launcher.cli.ExecuteBuildAction.run(ExecuteBuildAction.java:24)
    at org.gradle.launcher.exec.InProcessBuildActionExecuter.execute(InProcessBuildActionExecuter.java:39)
    at org.gradle.launcher.exec.InProcessBuildActionExecuter.execute(InProcessBuildActionExecuter.java:29)
    at org.gradle.launcher.cli.RunBuildAction.run(RunBuildAction.java:50)
    at org.gradle.internal.Actions$RunnableActionAdapter.execute(Actions.java:171)
    at org.gradle.launcher.cli.CommandLineActionFactory$ParseAndBuildAction.execute(CommandLineActionFactory.java:237)
    at org.gradle.launcher.cli.CommandLineActionFactory$ParseAndBuildAction.execute(CommandLineActionFactory.java:210)
    at org.gradle.launcher.cli.JavaRuntimeValidationAction.execute(JavaRuntimeValidationAction.java:35)
    at org.gradle.launcher.cli.JavaRuntimeValidationAction.execute(JavaRuntimeValidationAction.java:24)
    at org.gradle.launcher.cli.CommandLineActionFactory$WithLogging.execute(CommandLineActionFactory.java:206)
    at org.gradle.launcher.cli.CommandLineActionFactory$WithLogging.execute(CommandLineActionFactory.java:169)
    at org.gradle.launcher.cli.ExceptionReportingAction.execute(ExceptionReportingAction.java:33)
    at org.gradle.launcher.cli.ExceptionReportingAction.execute(ExceptionReportingAction.java:22)
    at org.gradle.launcher.Main.doAction(Main.java:33)
    at org.gradle.launcher.bootstrap.EntryPoint.run(EntryPoint.java:45)
    at sun.reflect.NativeMethodAccessorImpl.invoke0(Native Method)
    at sun.reflect.NativeMethodAccessorImpl.invoke(NativeMethodAccessorImpl.java:57)
    at sun.reflect.DelegatingMethodAccessorImpl.invoke(DelegatingMethodAccessorImpl.java:43)
    at java.lang.reflect.Method.invoke(Method.java:606)
    at org.gradle.launcher.bootstrap.ProcessBootstrap.runNoExit(ProcessBootstrap.java:54)
    at org.gradle.launcher.bootstrap.ProcessBootstrap.run(ProcessBootstrap.java:35)
    at org.gradle.launcher.GradleMain.main(GradleMain.java:23)
    at sun.reflect.NativeMethodAccessorImpl.invoke0(Native Method)
    at sun.reflect.NativeMethodAccessorImpl.invoke(NativeMethodAccessorImpl.java:57)
    at sun.reflect.DelegatingMethodAccessorImpl.invoke(DelegatingMethodAccessorImpl.java:43)
    at java.lang.reflect.Method.invoke(Method.java:606)
    at org.gradle.wrapper.BootstrapMainStarter.start(BootstrapMainStarter.java:30)
    at org.gradle.wrapper.WrapperExecutor.execute(WrapperExecutor.java:127)
    at org.gradle.wrapper.GradleWrapperMain.main(GradleWrapperMain.java:56)
java.lang.NullPointerException
    at com.google.common.base.Preconditions.checkNotNull(Preconditions.java:210)
    at com.google.common.base.Joiner.toString(Joiner.java:433)
    at com.google.common.base.Joiner.appendTo(Joiner.java:108)
    at com.google.common.base.Joiner.appendTo(Joiner.java:152)
    at com.google.common.base.Joiner.join(Joiner.java:193)
    at com.google.common.base.Joiner.join(Joiner.java:183)
    at net.minecraftforge.gradle.tasks.abstractutil.CachedTask.getHashes(CachedTask.java:275)
    at net.minecraftforge.gradle.tasks.abstractutil.CachedTask.access$500(CachedTask.java:41)
    at net.minecraftforge.gradle.tasks.abstractutil.CachedTask$2.execute(CachedTask.java:179)
    at net.minecraftforge.gradle.tasks.abstractutil.CachedTask$2.execute(CachedTask.java:166)
    at org.gradle.api.internal.AbstractTask$TaskActionWrapper.execute(AbstractTask.java:570)
    at org.gradle.api.internal.AbstractTask$TaskActionWrapper.execute(AbstractTask.java:553)
    at org.gradle.api.internal.tasks.execution.ExecuteActionsTaskExecuter.executeAction(ExecuteActionsTaskExecuter.java:80)
    at org.gradle.api.internal.tasks.execution.ExecuteActionsTaskExecuter.executeActions(ExecuteActionsTaskExecuter.java:61)
    at org.gradle.api.internal.tasks.execution.ExecuteActionsTaskExecuter.execute(ExecuteActionsTaskExecuter.java:46)
    at org.gradle.api.internal.tasks.execution.PostExecutionAnalysisTaskExecuter.execute(PostExecutionAnalysisTaskExecuter.java:35)
    at org.gradle.api.internal.tasks.execution.SkipUpToDateTaskExecuter.execute(SkipUpToDateTaskExecuter.java:64)
    at org.gradle.api.internal.tasks.execution.ValidatingTaskExecuter.execute(ValidatingTaskExecuter.java:58)
    at org.gradle.api.internal.tasks.execution.SkipEmptySourceFilesTaskExecuter.execute(SkipEmptySourceFilesTaskExecuter.java:42)
    at org.gradle.api.internal.tasks.execution.SkipTaskWithNoActionsExecuter.execute(SkipTaskWithNoActionsExecuter.java:52)
    at org.gradle.api.internal.tasks.execution.SkipOnlyIfTaskExecuter.execute(SkipOnlyIfTaskExecuter.java:53)
    at org.gradle.api.internal.tasks.execution.ExecuteAtMostOnceTaskExecuter.execute(ExecuteAtMostOnceTaskExecuter.java:43)
    at org.gradle.api.internal.AbstractTask.executeWithoutThrowingTaskFailure(AbstractTask.java:296)
    at org.gradle.execution.taskgraph.AbstractTaskPlanExecutor$TaskExecutorWorker.executeTask(AbstractTaskPlanExecutor.java:79)
    at org.gradle.execution.taskgraph.AbstractTaskPlanExecutor$TaskExecutorWorker.processTask(AbstractTaskPlanExecutor.java:63)
    at org.gradle.execution.taskgraph.AbstractTaskPlanExecutor$TaskExecutorWorker.run(AbstractTaskPlanExecutor.java:51)
    at org.gradle.execution.taskgraph.DefaultTaskPlanExecutor.process(DefaultTaskPlanExecutor.java:23)
    at org.gradle.execution.taskgraph.DefaultTaskGraphExecuter.execute(DefaultTaskGraphExecuter.java:86)
    at org.gradle.execution.SelectedTaskExecutionAction.execute(SelectedTaskExecutionAction.java:29)
    at org.gradle.execution.DefaultBuildExecuter.execute(DefaultBuildExecuter.java:61)
    at org.gradle.execution.DefaultBuildExecuter.access$200(DefaultBuildExecuter.java:23)
    at org.gradle.execution.DefaultBuildExecuter$2.proceed(DefaultBuildExecuter.java:67)
    at org.gradle.execution.DryRunBuildExecutionAction.execute(DryRunBuildExecutionAction.java:32)
    at org.gradle.execution.DefaultBuildExecuter.execute(DefaultBuildExecuter.java:61)
    at org.gradle.execution.DefaultBuildExecuter.execute(DefaultBuildExecuter.java:54)
    at org.gradle.initialization.DefaultGradleLauncher.doBuildStages(DefaultGradleLauncher.java:148)
    at org.gradle.initialization.DefaultGradleLauncher.doBuild(DefaultGradleLauncher.java:105)
    at org.gradle.initialization.DefaultGradleLauncher.run(DefaultGradleLauncher.java:85)
    at org.gradle.launcher.exec.InProcessBuildActionExecuter$DefaultBuildController.run(InProcessBuildActionExecuter.java:81)
    at org.gradle.launcher.cli.ExecuteBuildAction.run(ExecuteBuildAction.java:33)
    at org.gradle.launcher.cli.ExecuteBuildAction.run(ExecuteBuildAction.java:24)
    at org.gradle.launcher.exec.InProcessBuildActionExecuter.execute(InProcessBuildActionExecuter.java:39)
    at org.gradle.launcher.exec.InProcessBuildActionExecuter.execute(InProcessBuildActionExecuter.java:29)
    at org.gradle.launcher.cli.RunBuildAction.run(RunBuildAction.java:50)
    at org.gradle.internal.Actions$RunnableActionAdapter.execute(Actions.java:171)
    at org.gradle.launcher.cli.CommandLineActionFactory$ParseAndBuildAction.execute(CommandLineActionFactory.java:237)
    at org.gradle.launcher.cli.CommandLineActionFactory$ParseAndBuildAction.execute(CommandLineActionFactory.java:210)
    at org.gradle.launcher.cli.JavaRuntimeValidationAction.execute(JavaRuntimeValidationAction.java:35)
    at org.gradle.launcher.cli.JavaRuntimeValidationAction.execute(JavaRuntimeValidationAction.java:24)
    at org.gradle.launcher.cli.CommandLineActionFactory$WithLogging.execute(CommandLineActionFactory.java:206)
    at org.gradle.launcher.cli.CommandLineActionFactory$WithLogging.execute(CommandLineActionFactory.java:169)
    at org.gradle.launcher.cli.ExceptionReportingAction.execute(ExceptionReportingAction.java:33)
    at org.gradle.launcher.cli.ExceptionReportingAction.execute(ExceptionReportingAction.java:22)
    at org.gradle.launcher.Main.doAction(Main.java:33)
    at org.gradle.launcher.bootstrap.EntryPoint.run(EntryPoint.java:45)
    at sun.reflect.NativeMethodAccessorImpl.invoke0(Native Method)
    at sun.reflect.NativeMethodAccessorImpl.invoke(NativeMethodAccessorImpl.java:57)
    at sun.reflect.DelegatingMethodAccessorImpl.invoke(DelegatingMethodAccessorImpl.java:43)
    at java.lang.reflect.Method.invoke(Method.java:606)
    at org.gradle.launcher.bootstrap.ProcessBootstrap.runNoExit(ProcessBootstrap.java:54)
    at org.gradle.launcher.bootstrap.ProcessBootstrap.run(ProcessBootstrap.java:35)
    at org.gradle.launcher.GradleMain.main(GradleMain.java:23)
    at sun.reflect.NativeMethodAccessorImpl.invoke0(Native Method)
    at sun.reflect.NativeMethodAccessorImpl.invoke(NativeMethodAccessorImpl.java:57)
    at sun.reflect.DelegatingMethodAccessorImpl.invoke(DelegatingMethodAccessorImpl.java:43)
    at java.lang.reflect.Method.invoke(Method.java:606)
    at org.gradle.wrapper.BootstrapMainStarter.start(BootstrapMainStarter.java:30)
    at org.gradle.wrapper.WrapperExecutor.execute(WrapperExecutor.java:127)
    at org.gradle.wrapper.GradleWrapperMain.main(GradleWrapperMain.java:56)
java.util.zip.ZipException: too many length or distance symbols
    at java.util.zip.InflaterInputStream.read(InflaterInputStream.java:164)
    at java.util.zip.ZipInputStream.read(ZipInputStream.java:193)
    at java.io.FilterInputStream.read(FilterInputStream.java:107)
    at com.google.common.io.ByteStreams.copy(ByteStreams.java:70)
    at com.google.common.io.ByteStreams.toByteArray(ByteStreams.java:115)
    at net.minecraftforge.gradle.common.Constants.hashZip(Constants.java:196)
    at net.minecraftforge.gradle.common.Constants.hash(Constants.java:146)
    at net.minecraftforge.gradle.common.Constants.hashAll(Constants.java:161)
    at net.minecraftforge.gradle.tasks.abstractutil.CachedTask.getHashes(CachedTask.java:204)
    at net.minecraftforge.gradle.tasks.abstractutil.CachedTask.access$500(CachedTask.java:41)
    at net.minecraftforge.gradle.tasks.abstractutil.CachedTask$2.execute(CachedTask.java:179)
    at net.minecraftforge.gradle.tasks.abstractutil.CachedTask$2.execute(CachedTask.java:166)
    at org.gradle.api.internal.AbstractTask$TaskActionWrapper.execute(AbstractTask.java:570)
    at org.gradle.api.internal.AbstractTask$TaskActionWrapper.execute(AbstractTask.java:553)
    at org.gradle.api.internal.tasks.execution.ExecuteActionsTaskExecuter.executeAction(ExecuteActionsTaskExecuter.java:80)
    at org.gradle.api.internal.tasks.execution.ExecuteActionsTaskExecuter.executeActions(ExecuteActionsTaskExecuter.java:61)
    at org.gradle.api.internal.tasks.execution.ExecuteActionsTaskExecuter.execute(ExecuteActionsTaskExecuter.java:46)
    at org.gradle.api.internal.tasks.execution.PostExecutionAnalysisTaskExecuter.execute(PostExecutionAnalysisTaskExecuter.java:35)
    at org.gradle.api.internal.tasks.execution.SkipUpToDateTaskExecuter.execute(SkipUpToDateTaskExecuter.java:64)
    at org.gradle.api.internal.tasks.execution.ValidatingTaskExecuter.execute(ValidatingTaskExecuter.java:58)
    at org.gradle.api.internal.tasks.execution.SkipEmptySourceFilesTaskExecuter.execute(SkipEmptySourceFilesTaskExecuter.java:42)
    at org.gradle.api.internal.tasks.execution.SkipTaskWithNoActionsExecuter.execute(SkipTaskWithNoActionsExecuter.java:52)
    at org.gradle.api.internal.tasks.execution.SkipOnlyIfTaskExecuter.execute(SkipOnlyIfTaskExecuter.java:53)
    at org.gradle.api.internal.tasks.execution.ExecuteAtMostOnceTaskExecuter.execute(ExecuteAtMostOnceTaskExecuter.java:43)
    at org.gradle.api.internal.AbstractTask.executeWithoutThrowingTaskFailure(AbstractTask.java:296)
    at org.gradle.execution.taskgraph.AbstractTaskPlanExecutor$TaskExecutorWorker.executeTask(AbstractTaskPlanExecutor.java:79)
    at org.gradle.execution.taskgraph.AbstractTaskPlanExecutor$TaskExecutorWorker.processTask(AbstractTaskPlanExecutor.java:63)
    at org.gradle.execution.taskgraph.AbstractTaskPlanExecutor$TaskExecutorWorker.run(AbstractTaskPlanExecutor.java:51)
    at org.gradle.execution.taskgraph.DefaultTaskPlanExecutor.process(DefaultTaskPlanExecutor.java:23)
    at org.gradle.execution.taskgraph.DefaultTaskGraphExecuter.execute(DefaultTaskGraphExecuter.java:86)
    at org.gradle.execution.SelectedTaskExecutionAction.execute(SelectedTaskExecutionAction.java:29)
    at org.gradle.execution.DefaultBuildExecuter.execute(DefaultBuildExecuter.java:61)
    at org.gradle.execution.DefaultBuildExecuter.access$200(DefaultBuildExecuter.java:23)
    at org.gradle.execution.DefaultBuildExecuter$2.proceed(DefaultBuildExecuter.java:67)
    at org.gradle.execution.DryRunBuildExecutionAction.execute(DryRunBuildExecutionAction.java:32)
    at org.gradle.execution.DefaultBuildExecuter.execute(DefaultBuildExecuter.java:61)
    at org.gradle.execution.DefaultBuildExecuter.execute(DefaultBuildExecuter.java:54)
    at org.gradle.initialization.DefaultGradleLauncher.doBuildStages(DefaultGradleLauncher.java:148)
    at org.gradle.initialization.DefaultGradleLauncher.doBuild(DefaultGradleLauncher.java:105)
    at org.gradle.initialization.DefaultGradleLauncher.run(DefaultGradleLauncher.java:85)
    at org.gradle.launcher.exec.InProcessBuildActionExecuter$DefaultBuildController.run(InProcessBuildActionExecuter.java:81)
    at org.gradle.launcher.cli.ExecuteBuildAction.run(ExecuteBuildAction.java:33)
    at org.gradle.launcher.cli.ExecuteBuildAction.run(ExecuteBuildAction.java:24)
    at org.gradle.launcher.exec.InProcessBuildActionExecuter.execute(InProcessBuildActionExecuter.java:39)
    at org.gradle.launcher.exec.InProcessBuildActionExecuter.execute(InProcessBuildActionExecuter.java:29)
    at org.gradle.launcher.cli.RunBuildAction.run(RunBuildAction.java:50)
    at org.gradle.internal.Actions$RunnableActionAdapter.execute(Actions.java:171)
    at org.gradle.launcher.cli.CommandLineActionFactory$ParseAndBuildAction.execute(CommandLineActionFactory.java:237)
    at org.gradle.launcher.cli.CommandLineActionFactory$ParseAndBuildAction.execute(CommandLineActionFactory.java:210)
    at org.gradle.launcher.cli.JavaRuntimeValidationAction.execute(JavaRuntimeValidationAction.java:35)
    at org.gradle.launcher.cli.JavaRuntimeValidationAction.execute(JavaRuntimeValidationAction.java:24)
    at org.gradle.launcher.cli.CommandLineActionFactory$WithLogging.execute(CommandLineActionFactory.java:206)
    at org.gradle.launcher.cli.CommandLineActionFactory$WithLogging.execute(CommandLineActionFactory.java:169)
    at org.gradle.launcher.cli.ExceptionReportingAction.execute(ExceptionReportingAction.java:33)
    at org.gradle.launcher.cli.ExceptionReportingAction.execute(ExceptionReportingAction.java:22)
    at org.gradle.launcher.Main.doAction(Main.java:33)
    at org.gradle.launcher.bootstrap.EntryPoint.run(EntryPoint.java:45)
    at sun.reflect.NativeMethodAccessorImpl.invoke0(Native Method)
    at sun.reflect.NativeMethodAccessorImpl.invoke(NativeMethodAccessorImpl.java:57)
    at sun.reflect.DelegatingMethodAccessorImpl.invoke(DelegatingMethodAccessorImpl.java:43)
    at java.lang.reflect.Method.invoke(Method.java:606)
    at org.gradle.launcher.bootstrap.ProcessBootstrap.runNoExit(ProcessBootstrap.java:54)
    at org.gradle.launcher.bootstrap.ProcessBootstrap.run(ProcessBootstrap.java:35)
    at org.gradle.launcher.GradleMain.main(GradleMain.java:23)
    at sun.reflect.NativeMethodAccessorImpl.invoke0(Native Method)
    at sun.reflect.NativeMethodAccessorImpl.invoke(NativeMethodAccessorImpl.java:57)
    at sun.reflect.DelegatingMethodAccessorImpl.invoke(DelegatingMethodAccessorImpl.java:43)
    at java.lang.reflect.Method.invoke(Method.java:606)
    at org.gradle.wrapper.BootstrapMainStarter.start(BootstrapMainStarter.java:30)
    at org.gradle.wrapper.WrapperExecutor.execute(WrapperExecutor.java:127)
    at org.gradle.wrapper.GradleWrapperMain.main(GradleWrapperMain.java:56)
java.lang.NullPointerException
    at com.google.common.base.Preconditions.checkNotNull(Preconditions.java:210)
    at com.google.common.base.Joiner.toString(Joiner.java:433)
    at com.google.common.base.Joiner.appendTo(Joiner.java:108)
    at com.google.common.base.Joiner.appendTo(Joiner.java:152)
    at com.google.common.base.Joiner.join(Joiner.java:193)
    at com.google.common.base.Joiner.join(Joiner.java:183)
    at net.minecraftforge.gradle.tasks.abstractutil.CachedTask.getHashes(CachedTask.java:275)
    at net.minecraftforge.gradle.tasks.abstractutil.CachedTask.access$500(CachedTask.java:41)
    at net.minecraftforge.gradle.tasks.abstractutil.CachedTask$2.execute(CachedTask.java:179)
    at net.minecraftforge.gradle.tasks.abstractutil.CachedTask$2.execute(CachedTask.java:166)
    at org.gradle.api.internal.AbstractTask$TaskActionWrapper.execute(AbstractTask.java:570)
    at org.gradle.api.internal.AbstractTask$TaskActionWrapper.execute(AbstractTask.java:553)
    at org.gradle.api.internal.tasks.execution.ExecuteActionsTaskExecuter.executeAction(ExecuteActionsTaskExecuter.java:80)
    at org.gradle.api.internal.tasks.execution.ExecuteActionsTaskExecuter.executeActions(ExecuteActionsTaskExecuter.java:61)
    at org.gradle.api.internal.tasks.execution.ExecuteActionsTaskExecuter.execute(ExecuteActionsTaskExecuter.java:46)
    at org.gradle.api.internal.tasks.execution.PostExecutionAnalysisTaskExecuter.execute(PostExecutionAnalysisTaskExecuter.java:35)
    at org.gradle.api.internal.tasks.execution.SkipUpToDateTaskExecuter.execute(SkipUpToDateTaskExecuter.java:64)
    at org.gradle.api.internal.tasks.execution.ValidatingTaskExecuter.execute(ValidatingTaskExecuter.java:58)
    at org.gradle.api.internal.tasks.execution.SkipEmptySourceFilesTaskExecuter.execute(SkipEmptySourceFilesTaskExecuter.java:42)
    at org.gradle.api.internal.tasks.execution.SkipTaskWithNoActionsExecuter.execute(SkipTaskWithNoActionsExecuter.java:52)
    at org.gradle.api.internal.tasks.execution.SkipOnlyIfTaskExecuter.execute(SkipOnlyIfTaskExecuter.java:53)
    at org.gradle.api.internal.tasks.execution.ExecuteAtMostOnceTaskExecuter.execute(ExecuteAtMostOnceTaskExecuter.java:43)
    at org.gradle.api.internal.AbstractTask.executeWithoutThrowingTaskFailure(AbstractTask.java:296)
    at org.gradle.execution.taskgraph.AbstractTaskPlanExecutor$TaskExecutorWorker.executeTask(AbstractTaskPlanExecutor.java:79)
    at org.gradle.execution.taskgraph.AbstractTaskPlanExecutor$TaskExecutorWorker.processTask(AbstractTaskPlanExecutor.java:63)
    at org.gradle.execution.taskgraph.AbstractTaskPlanExecutor$TaskExecutorWorker.run(AbstractTaskPlanExecutor.java:51)
    at org.gradle.execution.taskgraph.DefaultTaskPlanExecutor.process(DefaultTaskPlanExecutor.java:23)
    at org.gradle.execution.taskgraph.DefaultTaskGraphExecuter.execute(DefaultTaskGraphExecuter.java:86)
    at org.gradle.execution.SelectedTaskExecutionAction.execute(SelectedTaskExecutionAction.java:29)
    at org.gradle.execution.DefaultBuildExecuter.execute(DefaultBuildExecuter.java:61)
    at org.gradle.execution.DefaultBuildExecuter.access$200(DefaultBuildExecuter.java:23)
    at org.gradle.execution.DefaultBuildExecuter$2.proceed(DefaultBuildExecuter.java:67)
    at org.gradle.execution.DryRunBuildExecutionAction.execute(DryRunBuildExecutionAction.java:32)
    at org.gradle.execution.DefaultBuildExecuter.execute(DefaultBuildExecuter.java:61)
    at org.gradle.execution.DefaultBuildExecuter.execute(DefaultBuildExecuter.java:54)
    at org.gradle.initialization.DefaultGradleLauncher.doBuildStages(DefaultGradleLauncher.java:148)
    at org.gradle.initialization.DefaultGradleLauncher.doBuild(DefaultGradleLauncher.java:105)
    at org.gradle.initialization.DefaultGradleLauncher.run(DefaultGradleLauncher.java:85)
    at org.gradle.launcher.exec.InProcessBuildActionExecuter$DefaultBuildController.run(InProcessBuildActionExecuter.java:81)
    at org.gradle.launcher.cli.ExecuteBuildAction.run(ExecuteBuildAction.java:33)
    at org.gradle.launcher.cli.ExecuteBuildAction.run(ExecuteBuildAction.java:24)
    at org.gradle.launcher.exec.InProcessBuildActionExecuter.execute(InProcessBuildActionExecuter.java:39)
    at org.gradle.launcher.exec.InProcessBuildActionExecuter.execute(InProcessBuildActionExecuter.java:29)
    at org.gradle.launcher.cli.RunBuildAction.run(RunBuildAction.java:50)
    at org.gradle.internal.Actions$RunnableActionAdapter.execute(Actions.java:171)
    at org.gradle.launcher.cli.CommandLineActionFactory$ParseAndBuildAction.execute(CommandLineActionFactory.java:237)
    at org.gradle.launcher.cli.CommandLineActionFactory$ParseAndBuildAction.execute(CommandLineActionFactory.java:210)
    at org.gradle.launcher.cli.JavaRuntimeValidationAction.execute(JavaRuntimeValidationAction.java:35)
    at org.gradle.launcher.cli.JavaRuntimeValidationAction.execute(JavaRuntimeValidationAction.java:24)
    at org.gradle.launcher.cli.CommandLineActionFactory$WithLogging.execute(CommandLineActionFactory.java:206)
    at org.gradle.launcher.cli.CommandLineActionFactory$WithLogging.execute(CommandLineActionFactory.java:169)
    at org.gradle.launcher.cli.ExceptionReportingAction.execute(ExceptionReportingAction.java:33)
    at org.gradle.launcher.cli.ExceptionReportingAction.execute(ExceptionReportingAction.java:22)
    at org.gradle.launcher.Main.doAction(Main.java:33)
    at org.gradle.launcher.bootstrap.EntryPoint.run(EntryPoint.java:45)
    at sun.reflect.NativeMethodAccessorImpl.invoke0(Native Method)
    at sun.reflect.NativeMethodAccessorImpl.invoke(NativeMethodAccessorImpl.java:57)
    at sun.reflect.DelegatingMethodAccessorImpl.invoke(DelegatingMethodAccessorImpl.java:43)
    at java.lang.reflect.Method.invoke(Method.java:606)
    at org.gradle.launcher.bootstrap.ProcessBootstrap.runNoExit(ProcessBootstrap.java:54)
    at org.gradle.launcher.bootstrap.ProcessBootstrap.run(ProcessBootstrap.java:35)
    at org.gradle.launcher.GradleMain.main(GradleMain.java:23)
    at sun.reflect.NativeMethodAccessorImpl.invoke0(Native Method)
    at sun.reflect.NativeMethodAccessorImpl.invoke(NativeMethodAccessorImpl.java:57)
    at sun.reflect.DelegatingMethodAccessorImpl.invoke(DelegatingMethodAccessorImpl.java:43)
    at java.lang.reflect.Method.invoke(Method.java:606)
    at org.gradle.wrapper.BootstrapMainStarter.start(BootstrapMainStarter.java:30)
    at org.gradle.wrapper.WrapperExecutor.execute(WrapperExecutor.java:127)
    at org.gradle.wrapper.GradleWrapperMain.main(GradleWrapperMain.java:56)
:downloadClient
:downloadClient
java.util.zip.ZipException: invalid entry size (expected 0 but got 2066 bytes)
    at java.util.zip.ZipInputStream.readEnd(ZipInputStream.java:403)
    at java.util.zip.ZipInputStream.read(ZipInputStream.java:195)
    at java.io.FilterInputStream.read(FilterInputStream.java:107)
    at com.google.common.io.ByteStreams.copy(ByteStreams.java:70)
    at com.google.common.io.ByteStreams.toByteArray(ByteStreams.java:115)
    at net.minecraftforge.gradle.common.Constants.hashZip(Constants.java:196)
    at net.minecraftforge.gradle.common.Constants.hash(Constants.java:146)
    at net.minecraftforge.gradle.common.Constants.hashAll(Constants.java:161)
    at net.minecraftforge.gradle.tasks.abstractutil.CachedTask.getHashes(CachedTask.java:204)
    at net.minecraftforge.gradle.tasks.abstractutil.CachedTask.access$500(CachedTask.java:41)
    at net.minecraftforge.gradle.tasks.abstractutil.CachedTask$2.execute(CachedTask.java:179)
    at net.minecraftforge.gradle.tasks.abstractutil.CachedTask$2.execute(CachedTask.java:166)
    at org.gradle.api.internal.AbstractTask$TaskActionWrapper.execute(AbstractTask.java:570)
    at org.gradle.api.internal.AbstractTask$TaskActionWrapper.execute(AbstractTask.java:553)
    at org.gradle.api.internal.tasks.execution.ExecuteActionsTaskExecuter.executeAction(ExecuteActionsTaskExecuter.java:80)
    at org.gradle.api.internal.tasks.execution.ExecuteActionsTaskExecuter.executeActions(ExecuteActionsTaskExecuter.java:61)
    at org.gradle.api.internal.tasks.execution.ExecuteActionsTaskExecuter.execute(ExecuteActionsTaskExecuter.java:46)
    at org.gradle.api.internal.tasks.execution.PostExecutionAnalysisTaskExecuter.execute(PostExecutionAnalysisTaskExecuter.java:35)
    at org.gradle.api.internal.tasks.execution.SkipUpToDateTaskExecuter.execute(SkipUpToDateTaskExecuter.java:64)
    at org.gradle.api.internal.tasks.execution.ValidatingTaskExecuter.execute(ValidatingTaskExecuter.java:58)
    at org.gradle.api.internal.tasks.execution.SkipEmptySourceFilesTaskExecuter.execute(SkipEmptySourceFilesTaskExecuter.java:42)
    at org.gradle.api.internal.tasks.execution.SkipTaskWithNoActionsExecuter.execute(SkipTaskWithNoActionsExecuter.java:52)
    at org.gradle.api.internal.tasks.execution.SkipOnlyIfTaskExecuter.execute(SkipOnlyIfTaskExecuter.java:53)
    at org.gradle.api.internal.tasks.execution.ExecuteAtMostOnceTaskExecuter.execute(ExecuteAtMostOnceTaskExecuter.java:43)
    at org.gradle.api.internal.AbstractTask.executeWithoutThrowingTaskFailure(AbstractTask.java:296)
    at org.gradle.execution.taskgraph.AbstractTaskPlanExecutor$TaskExecutorWorker.executeTask(AbstractTaskPlanExecutor.java:79)
    at org.gradle.execution.taskgraph.AbstractTaskPlanExecutor$TaskExecutorWorker.processTask(AbstractTaskPlanExecutor.java:63)
    at org.gradle.execution.taskgraph.AbstractTaskPlanExecutor$TaskExecutorWorker.run(AbstractTaskPlanExecutor.java:51)
    at org.gradle.execution.taskgraph.DefaultTaskPlanExecutor.process(DefaultTaskPlanExecutor.java:23)
    at org.gradle.execution.taskgraph.DefaultTaskGraphExecuter.execute(DefaultTaskGraphExecuter.java:86)
    at org.gradle.execution.SelectedTaskExecutionAction.execute(SelectedTaskExecutionAction.java:29)
    at org.gradle.execution.DefaultBuildExecuter.execute(DefaultBuildExecuter.java:61)
    at org.gradle.execution.DefaultBuildExecuter.access$200(DefaultBuildExecuter.java:23)
    at org.gradle.execution.DefaultBuildExecuter$2.proceed(DefaultBuildExecuter.java:67)
    at org.gradle.execution.DryRunBuildExecutionAction.execute(DryRunBuildExecutionAction.java:32)
    at org.gradle.execution.DefaultBuildExecuter.execute(DefaultBuildExecuter.java:61)
    at org.gradle.execution.DefaultBuildExecuter.execute(DefaultBuildExecuter.java:54)
    at org.gradle.initialization.DefaultGradleLauncher.doBuildStages(DefaultGradleLauncher.java:148)
    at org.gradle.initialization.DefaultGradleLauncher.doBuild(DefaultGradleLauncher.java:105)
    at org.gradle.initialization.DefaultGradleLauncher.run(DefaultGradleLauncher.java:85)
    at org.gradle.launcher.exec.InProcessBuildActionExecuter$DefaultBuildController.run(InProcessBuildActionExecuter.java:81)
    at org.gradle.launcher.cli.ExecuteBuildAction.run(ExecuteBuildAction.java:33)
    at org.gradle.launcher.cli.ExecuteBuildAction.run(ExecuteBuildAction.java:24)
    at org.gradle.launcher.exec.InProcessBuildActionExecuter.execute(InProcessBuildActionExecuter.java:39)
    at org.gradle.launcher.exec.InProcessBuildActionExecuter.execute(InProcessBuildActionExecuter.java:29)
    at org.gradle.launcher.cli.RunBuildAction.run(RunBuildAction.java:50)
    at org.gradle.internal.Actions$RunnableActionAdapter.execute(Actions.java:171)
    at org.gradle.launcher.cli.CommandLineActionFactory$ParseAndBuildAction.execute(CommandLineActionFactory.java:237)
    at org.gradle.launcher.cli.CommandLineActionFactory$ParseAndBuildAction.execute(CommandLineActionFactory.java:210)
    at org.gradle.launcher.cli.JavaRuntimeValidationAction.execute(JavaRuntimeValidationAction.java:35)
    at org.gradle.launcher.cli.JavaRuntimeValidationAction.execute(JavaRuntimeValidationAction.java:24)
    at org.gradle.launcher.cli.CommandLineActionFactory$WithLogging.execute(CommandLineActionFactory.java:206)
    at org.gradle.launcher.cli.CommandLineActionFactory$WithLogging.execute(CommandLineActionFactory.java:169)
    at org.gradle.launcher.cli.ExceptionReportingAction.execute(ExceptionReportingAction.java:33)
    at org.gradle.launcher.cli.ExceptionReportingAction.execute(ExceptionReportingAction.java:22)
    at org.gradle.launcher.Main.doAction(Main.java:33)
    at org.gradle.launcher.bootstrap.EntryPoint.run(EntryPoint.java:45)
    at sun.reflect.NativeMethodAccessorImpl.invoke0(Native Method)
    at sun.reflect.NativeMethodAccessorImpl.invoke(NativeMethodAccessorImpl.java:57)
    at sun.reflect.DelegatingMethodAccessorImpl.invoke(DelegatingMethodAccessorImpl.java:43)
    at java.lang.reflect.Method.invoke(Method.java:606)
    at org.gradle.launcher.bootstrap.ProcessBootstrap.runNoExit(ProcessBootstrap.java:54)
    at org.gradle.launcher.bootstrap.ProcessBootstrap.run(ProcessBootstrap.java:35)
    at org.gradle.launcher.GradleMain.main(GradleMain.java:23)
    at sun.reflect.NativeMethodAccessorImpl.invoke0(Native Method)
    at sun.reflect.NativeMethodAccessorImpl.invoke(NativeMethodAccessorImpl.java:57)
    at sun.reflect.DelegatingMethodAccessorImpl.invoke(DelegatingMethodAccessorImpl.java:43)
    at java.lang.reflect.Method.invoke(Method.java:606)
    at org.gradle.wrapper.BootstrapMainStarter.start(BootstrapMainStarter.java:30)
    at org.gradle.wrapper.WrapperExecutor.execute(WrapperExecutor.java:127)
    at org.gradle.wrapper.GradleWrapperMain.main(GradleWrapperMain.java:56)
java.lang.NullPointerException
    at com.google.common.base.Preconditions.checkNotNull(Preconditions.java:210)
    at com.google.common.base.Joiner.toString(Joiner.java:433)
    at com.google.common.base.Joiner.appendTo(Joiner.java:108)
    at com.google.common.base.Joiner.appendTo(Joiner.java:152)
    at com.google.common.base.Joiner.join(Joiner.java:193)
    at com.google.common.base.Joiner.join(Joiner.java:183)
    at net.minecraftforge.gradle.tasks.abstractutil.CachedTask.getHashes(CachedTask.java:275)
    at net.minecraftforge.gradle.tasks.abstractutil.CachedTask.access$500(CachedTask.java:41)
    at net.minecraftforge.gradle.tasks.abstractutil.CachedTask$2.execute(CachedTask.java:179)
    at net.minecraftforge.gradle.tasks.abstractutil.CachedTask$2.execute(CachedTask.java:166)
    at org.gradle.api.internal.AbstractTask$TaskActionWrapper.execute(AbstractTask.java:570)
    at org.gradle.api.internal.AbstractTask$TaskActionWrapper.execute(AbstractTask.java:553)
    at org.gradle.api.internal.tasks.execution.ExecuteActionsTaskExecuter.executeAction(ExecuteActionsTaskExecuter.java:80)
    at org.gradle.api.internal.tasks.execution.ExecuteActionsTaskExecuter.executeActions(ExecuteActionsTaskExecuter.java:61)
    at org.gradle.api.internal.tasks.execution.ExecuteActionsTaskExecuter.execute(ExecuteActionsTaskExecuter.java:46)
    at org.gradle.api.internal.tasks.execution.PostExecutionAnalysisTaskExecuter.execute(PostExecutionAnalysisTaskExecuter.java:35)
    at org.gradle.api.internal.tasks.execution.SkipUpToDateTaskExecuter.execute(SkipUpToDateTaskExecuter.java:64)
    at org.gradle.api.internal.tasks.execution.ValidatingTaskExecuter.execute(ValidatingTaskExecuter.java:58)
    at org.gradle.api.internal.tasks.execution.SkipEmptySourceFilesTaskExecuter.execute(SkipEmptySourceFilesTaskExecuter.java:42)
    at org.gradle.api.internal.tasks.execution.SkipTaskWithNoActionsExecuter.execute(SkipTaskWithNoActionsExecuter.java:52)
    at org.gradle.api.internal.tasks.execution.SkipOnlyIfTaskExecuter.execute(SkipOnlyIfTaskExecuter.java:53)
    at org.gradle.api.internal.tasks.execution.ExecuteAtMostOnceTaskExecuter.execute(ExecuteAtMostOnceTaskExecuter.java:43)
    at org.gradle.api.internal.AbstractTask.executeWithoutThrowingTaskFailure(AbstractTask.java:296)
    at org.gradle.execution.taskgraph.AbstractTaskPlanExecutor$TaskExecutorWorker.executeTask(AbstractTaskPlanExecutor.java:79)
    at org.gradle.execution.taskgraph.AbstractTaskPlanExecutor$TaskExecutorWorker.processTask(AbstractTaskPlanExecutor.java:63)
    at org.gradle.execution.taskgraph.AbstractTaskPlanExecutor$TaskExecutorWorker.run(AbstractTaskPlanExecutor.java:51)
    at org.gradle.execution.taskgraph.DefaultTaskPlanExecutor.process(DefaultTaskPlanExecutor.java:23)
    at org.gradle.execution.taskgraph.DefaultTaskGraphExecuter.execute(DefaultTaskGraphExecuter.java:86)
    at org.gradle.execution.SelectedTaskExecutionAction.execute(SelectedTaskExecutionAction.java:29)
    at org.gradle.execution.DefaultBuildExecuter.execute(DefaultBuildExecuter.java:61)
    at org.gradle.execution.DefaultBuildExecuter.access$200(DefaultBuildExecuter.java:23)
    at org.gradle.execution.DefaultBuildExecuter$2.proceed(DefaultBuildExecuter.java:67)
    at org.gradle.execution.DryRunBuildExecutionAction.execute(DryRunBuildExecutionAction.java:32)
    at org.gradle.execution.DefaultBuildExecuter.execute(DefaultBuildExecuter.java:61)
    at org.gradle.execution.DefaultBuildExecuter.execute(DefaultBuildExecuter.java:54)
    at org.gradle.initialization.DefaultGradleLauncher.doBuildStages(DefaultGradleLauncher.java:148)
    at org.gradle.initialization.DefaultGradleLauncher.doBuild(DefaultGradleLauncher.java:105)
    at org.gradle.initialization.DefaultGradleLauncher.run(DefaultGradleLauncher.java:85)
    at org.gradle.launcher.exec.InProcessBuildActionExecuter$DefaultBuildController.run(InProcessBuildActionExecuter.java:81)
    at org.gradle.launcher.cli.ExecuteBuildAction.run(ExecuteBuildAction.java:33)
    at org.gradle.launcher.cli.ExecuteBuildAction.run(ExecuteBuildAction.java:24)
    at org.gradle.launcher.exec.InProcessBuildActionExecuter.execute(InProcessBuildActionExecuter.java:39)
    at org.gradle.launcher.exec.InProcessBuildActionExecuter.execute(InProcessBuildActionExecuter.java:29)
    at org.gradle.launcher.cli.RunBuildAction.run(RunBuildAction.java:50)
    at org.gradle.internal.Actions$RunnableActionAdapter.execute(Actions.java:171)
    at org.gradle.launcher.cli.CommandLineActionFactory$ParseAndBuildAction.execute(CommandLineActionFactory.java:237)
    at org.gradle.launcher.cli.CommandLineActionFactory$ParseAndBuildAction.execute(CommandLineActionFactory.java:210)
    at org.gradle.launcher.cli.JavaRuntimeValidationAction.execute(JavaRuntimeValidationAction.java:35)
    at org.gradle.launcher.cli.JavaRuntimeValidationAction.execute(JavaRuntimeValidationAction.java:24)
    at org.gradle.launcher.cli.CommandLineActionFactory$WithLogging.execute(CommandLineActionFactory.java:206)
    at org.gradle.launcher.cli.CommandLineActionFactory$WithLogging.execute(CommandLineActionFactory.java:169)
    at org.gradle.launcher.cli.ExceptionReportingAction.execute(ExceptionReportingAction.java:33)
    at org.gradle.launcher.cli.ExceptionReportingAction.execute(ExceptionReportingAction.java:22)
    at org.gradle.launcher.Main.doAction(Main.java:33)
    at org.gradle.launcher.bootstrap.EntryPoint.run(EntryPoint.java:45)
    at sun.reflect.NativeMethodAccessorImpl.invoke0(Native Method)
    at sun.reflect.NativeMethodAccessorImpl.invoke(NativeMethodAccessorImpl.java:57)
    at sun.reflect.DelegatingMethodAccessorImpl.invoke(DelegatingMethodAccessorImpl.java:43)
    at java.lang.reflect.Method.invoke(Method.java:606)
    at org.gradle.launcher.bootstrap.ProcessBootstrap.runNoExit(ProcessBootstrap.java:54)
    at org.gradle.launcher.bootstrap.ProcessBootstrap.run(ProcessBootstrap.java:35)
    at org.gradle.launcher.GradleMain.main(GradleMain.java:23)
    at sun.reflect.NativeMethodAccessorImpl.invoke0(Native Method)
    at sun.reflect.NativeMethodAccessorImpl.invoke(NativeMethodAccessorImpl.java:57)
    at sun.reflect.DelegatingMethodAccessorImpl.invoke(DelegatingMethodAccessorImpl.java:43)
    at java.lang.reflect.Method.invoke(Method.java:606)
    at org.gradle.wrapper.BootstrapMainStarter.start(BootstrapMainStarter.java:30)
    at org.gradle.wrapper.WrapperExecutor.execute(WrapperExecutor.java:127)
    at org.gradle.wrapper.GradleWrapperMain.main(GradleWrapperMain.java:56)
:downloadClient

 

Last seen on 21:46, 3. Jun 2016
Joined May 2016
User points:

Statistics:

  • Comments:
  • Forum topics:
  • Modifications:
  • Wiki pages:
RE:Okay, so I just finished a
Tue, 05/31/2016 - 22:25

 Nevermind, it fixed itself 

Last seen on 11:14, 5. Jun 2016
Joined May 2016
User points:

Statistics:

  • Comments:
  • Forum topics:
  • Modifications:
  • Wiki pages:
can some one can fix this
Fri, 06/03/2016 - 08:49

can some one can fix this please 

if i export or run client it say 

 

Executing gradle command: runClient
Microsoft Windows [Version 6.1.7600]
Copyright (c) 2009 Microsoft Corporation.  All rights reserved.
D:\Pylo\MCreator163>cd forge
D:\Pylo\MCreator163\forge>SET "JAVA_HOME=D:\Pylo\MCreator163\jdk\"
D:\Pylo\MCreator163\forge>SET JAVA_EXE=%JAVA_HOME%\bin\java.exe
D:\Pylo\MCreator163\forge>SET PATH=%JAVA_HOME%\bin\;%PATH%
'gradlew' is not recognized as an internal or external command,
operable program or batch file.
D:\Pylo\MCreator163\forge>gradlew runClient
D:\Pylo\MCreator163\forge>
Task completed with return code 0 in 191 milliseconds
Task return code check OK!

 

 

and nothing was hapend please help

Last seen on 21:32, 14. Apr 2018
Joined Aug 2015
User points:

Statistics:

  • Comments:
  • Forum topics:
  • Modifications:
  • Wiki pages:
Same here !:clean UP-TO-DATE
Fri, 06/03/2016 - 12:42

Same here !
:clean UP-TO-DATE
:deobfCompileDummyTask
:deobfProvidedDummyTask
FAILURE: Build failed with an exception.
:getVersionJson
* What went wrong:
java.io.FileNotFoundException: C:\Users\IuStrenght\Desktop\Mod\forge\.gradle\2.7\taskArtifacts\cache.properties (The system cannot find the file specified)
BUILD FAILED
Total time: 22.385 secs
> C:\Users\IuStrenght\Desktop\Mod\forge\.gradle\2.7\taskArtifacts\cache.properties (The system cannot find the file specified)
* Try:
Run with --stacktrace option to get the stack trace. Run with --info or --debug option to get more log output.
C:\Users\IuStrenght\Desktop\Mod\forge>
Task completed with return code 0 in 26723 milliseconds