Every time I add a new block, build bugs out

Started by marneman on Wed, 04/26/2017 - 02:46

Topic category: Bugs and solutions

Last seen on 08:40, 25. Mar 2018
Joined Apr 2017
User points:

Statistics:

  • Comments:
  • Forum topics:
  • Modifications:
  • Wiki pages:
Every time I add a new block, build bugs out
Wed, 04/26/2017 - 02:46

Somewhat self-explanatory. I have a simple mod that has a few test blocks in it. Every time I go to add a new block, I save it, then the build fails on the existing blocks saying it can't resolve symbol. I open each of those old blocks, and keep hitting "Next" until it resaves. Then my build works again.

Last seen on 08:40, 25. Mar 2018
Joined Apr 2017
User points:

Statistics:

  • Comments:
  • Forum topics:
  • Modifications:
  • Wiki pages:
Ok, found a workaround. If I
Wed, 04/26/2017 - 07:49

Ok, found a workaround. If I rename my workspace to something other than the default name, everything seems fine!

Last seen on 08:40, 25. Mar 2018
Joined Apr 2017
User points:

Statistics:

  • Comments:
  • Forum topics:
  • Modifications:
  • Wiki pages:
Spoke too soon. It was
Wed, 04/26/2017 - 10:55

Spoke too soon. It was working fine as long as I was just adding normal blocks, but when I tried to add an OBJ/MTL file, it crapped out again. Had to go back and resave each of my old blocks to get rid of the error.

Last seen on 08:40, 25. Mar 2018
Joined Apr 2017
User points:

Statistics:

  • Comments:
  • Forum topics:
  • Modifications:
  • Wiki pages:
Here is my build log. Maybe
Wed, 04/26/2017 - 11:23

Here is my build log. Maybe it will help you diagnose the problem. It keeps happening, making using the tool very labor intensive :(

 

[spoiler]

   
Executing gradle command: clean build
Microsoft Windows [Version 10.0.14393]
(c) 2016 Microsoft Corporation. All rights reserved.
F:\apps\Pylo\MCreator175>cd forge
F:\apps\Pylo\MCreator175\forge>SET "JAVA_HOME=F:\apps\Pylo\MCreator175\jdk64\"
F:\apps\Pylo\MCreator175\forge>SET JAVA_EXE=%JAVA_HOME%\bin\java.exe
F:\apps\Pylo\MCreator175\forge>SET PATH=%JAVA_HOME%\bin\;%PATH%
F:\apps\Pylo\MCreator175\forge>gradlew -Dorg.gradle.jvmargs="-Xms1000m -Xmx3567m" clean build 
This mapping 'snapshot_20161220' was designed for MC 1.11! Use at your own peril.
#################################################
         ForgeGradle 2.2-SNAPSHOT-7f5a769        
  https://github.com/MinecraftForge/ForgeGradle  
#################################################
               Powered by MCP unknown               
             http://modcoderpack.com             
         by: Searge, ProfMobius, Fesh0r,         
         R4wk, ZeuX, IngisKahn, bspkrs           
#################################################
:clean
:deobfCompileDummyTask
:deobfProvidedDummyTask
:sourceApiJava
:compileApiJava UP-TO-DATE
:processApiResources UP-TO-DATE
:apiClasses UP-TO-DATE
:sourceMainJava
F:\apps\Pylo\MCreator175\forge\build\sources\main\java\mod\mcreator\mcreator_brpOvalWindow2.java:28: error: class mcreator_testenvironmentmodOvalWindow2 is public, should be declared in a file named mcreator_testenvironmentmodOvalWindow2.java
public class mcreator_testenvironmentmodOvalWindow2 {
       ^
F:\apps\Pylo\MCreator175\forge\build\sources\main\java\mod\mcreator\mcreator_brpOvalWindowAcacia.java:28: error: class mcreator_testenvironmentmodOvalWindowAcacia is public, should be declared in a file named mcreator_testenvironmentmodOvalWindowAcacia.java
public class mcreator_testenvironmentmodOvalWindowAcacia {
       ^
F:\apps\Pylo\MCreator175\forge\build\sources\main\java\mod\mcreator\mcreator_brpOvalWindowAcacia2.java:28: error: class mcreator_testenvironmentmodOvalWindowAcacia2 is public, should be declared in a file named mcreator_testenvironmentmodOvalWindowAcacia2.java
public class mcreator_testenvironmentmodOvalWindowAcacia2 {
       ^
F:\apps\Pylo\MCreator175\forge\build\sources\main\java\mod\mcreator\mcreator_brpOvalWindowBigOak.java:28: error: class mcreator_testenvironmentmodOvalWindowBigOak is public, should be declared in a file named mcreator_testenvironmentmodOvalWindowBigOak.java
public class mcreator_testenvironmentmodOvalWindowBigOak {
       ^
F:\apps\Pylo\MCreator175\forge\build\sources\main\java\mod\mcreator\mcreator_brpOvalWindowBigOak2.java:28: error: class mcreator_testenvironmentmodOvalWindowBigOak2 is public, should be declared in a file named mcreator_testenvironmentmodOvalWindowBigOak2.java
public class mcreator_testenvironmentmodOvalWindowBigOak2 {
       ^
F:\apps\Pylo\MCreator175\forge\build\sources\main\java\mod\mcreator\mcreator_brpOvalWindowBirch.java:28: error: class mcreator_testenvironmentmodOvalWindowBirch is public, should be declared in a file named mcreator_testenvironmentmodOvalWindowBirch.java
public class mcreator_testenvironmentmodOvalWindowBirch {
       ^
F:\apps\Pylo\MCreator175\forge\build\sources\main\java\mod\mcreator\mcreator_brpOvalWindowBirch2.java:28: error: class mcreator_testenvironmentmodOvalWindowBirch2 is public, should be declared in a file named mcreator_testenvironmentmodOvalWindowBirch2.java
public class mcreator_testenvironmentmodOvalWindowBirch2 {
       ^
F:\apps\Pylo\MCreator175\forge\build\sources\main\java\mod\mcreator\mcreator_brpOvalWindowBrick.java:28: error: class mcreator_testenvironmentmodOvalWindowBrick is public, should be declared in a file named mcreator_testenvironmentmodOvalWindowBrick.java
public class mcreator_testenvironmentmodOvalWindowBrick {
       ^
F:\apps\Pylo\MCreator175\forge\build\sources\main\java\mod\mcreator\mcreator_brpOvalWindowOak.java:28: error: class mcreator_testenvironmentmodOvalWindowOak is public, should be declared in a file named mcreator_testenvironmentmodOvalWindowOak.java
public class mcreator_testenvironmentmodOvalWindowOak {
       ^
F:\apps\Pylo\MCreator175\forge\build\sources\main\java\mod\mcreator\mcreator_brpOvalWindowOak2.java:28: error: class mcreator_testenvironmentmodOvalWindowOak2 is public, should be declared in a file named mcreator_testenvironmentmodOvalWindowOak2.java
public class mcreator_testenvironmentmodOvalWindowOak2 {
       ^
F:\apps\Pylo\MCreator175\forge\build\sources\main\java\mod\mcreator\mcreator_brpOvalWindowSpruce.java:28: error: class mcreator_testenvironmentmodOvalWindowSpruce is public, should be declared in a file named mcreator_testenvironmentmodOvalWindowSpruce.java
public class mcreator_testenvironmentmodOvalWindowSpruce {
       ^
F:\apps\Pylo\MCreator175\forge\build\sources\main\java\mod\mcreator\mcreator_brpOvalWindowSpruce2.java:28: error: class mcreator_testenvironmentmodOvalWindowSpruce2 is public, should be declared in a file named mcreator_testenvironmentmodOvalWindowSpruce2.java
public class mcreator_testenvironmentmodOvalWindowSpruce2 {
       ^
F:\apps\Pylo\MCreator175\forge\build\sources\main\java\mod\mcreator\mcreator_brpTab.java:15: error: class mcreator_testenvironmentmodTab is public, should be declared in a file named mcreator_testenvironmentmodTab.java
public class mcreator_testenvironmentmodTab {
       ^
F:\apps\Pylo\MCreator175\forge\build\sources\main\java\mod\mcreator\mcreator_brpTile1.java:28: error: class mcreator_testenvironmentmodTile1 is public, should be declared in a file named mcreator_testenvironmentmodTile1.java
public class mcreator_testenvironmentmodTile1 {
       ^
F:\apps\Pylo\MCreator175\forge\build\sources\main\java\mod\mcreator\mcreator_brpTile10.java:28: error: class mcreator_testenvironmentmodTile10 is public, should be declared in a file named mcreator_testenvironmentmodTile10.java
public class mcreator_testenvironmentmodTile10 {
       ^
F:\apps\Pylo\MCreator175\forge\build\sources\main\java\mod\mcreator\mcreator_brpTile11.java:28: error: class mcreator_testenvironmentmodTile11 is public, should be declared in a file named mcreator_testenvironmentmodTile11.java
public class mcreator_testenvironmentmodTile11 {
       ^
F:\apps\Pylo\MCreator175\forge\build\sources\main\java\mod\mcreator\mcreator_brpTile12.java:28: error: class mcreator_testenvironmentmodTile12 is public, should be declared in a file named mcreator_testenvironmentmodTile12.java
public class mcreator_testenvironmentmodTile12 {
       ^
F:\apps\Pylo\MCreator175\forge\build\sources\main\java\mod\mcreator\mcreator_brpTile13.java:28: error: class mcreator_testenvironmentmodTile13 is public, should be declared in a file named mcreator_testenvironmentmodTile13.java
public class mcreator_testenvironmentmodTile13 {
       ^
F:\apps\Pylo\MCreator175\forge\build\sources\main\java\mod\mcreator\mcreator_brpTile14.java:28: error: class mcreator_testenvironmentmodTile14 is public, should be declared in a file named mcreator_testenvironmentmodTile14.java
public class mcreator_testenvironmentmodTile14 {
       ^
F:\apps\Pylo\MCreator175\forge\build\sources\main\java\mod\mcreator\mcreator_brpTile2.java:28: error: class mcreator_testenvironmentmodTile2 is public, should be declared in a file named mcreator_testenvironmentmodTile2.java
public class mcreator_testenvironmentmodTile2 {
       ^
F:\apps\Pylo\MCreator175\forge\build\sources\main\java\mod\mcreator\mcreator_brpTile3.java:28: error: class mcreator_testenvironmentmodTile3 is public, should be declared in a file named mcreator_testenvironmentmodTile3.java
public class mcreator_testenvironmentmodTile3 {
       ^
F:\apps\Pylo\MCreator175\forge\build\sources\main\java\mod\mcreator\mcreator_brpTile4.java:28: error: class mcreator_testenvironmentmodTile4 is public, should be declared in a file named mcreator_testenvironmentmodTile4.java
public class mcreator_testenvironmentmodTile4 {
       ^
F:\apps\Pylo\MCreator175\forge\build\sources\main\java\mod\mcreator\mcreator_brpTile5.java:28: error: class mcreator_testenvironmentmodTile5 is public, should be declared in a file named mcreator_testenvironmentmodTile5.java
public class mcreator_testenvironmentmodTile5 {
       ^
F:\apps\Pylo\MCreator175\forge\build\sources\main\java\mod\mcreator\mcreator_brpTile6.java:28: error: class mcreator_testenvironmentmodTile6 is public, should be declared in a file named mcreator_testenvironmentmodTile6.java
public class mcreator_testenvironmentmodTile6 {
       ^
F:\apps\Pylo\MCreator175\forge\build\sources\main\java\mod\mcreator\mcreator_brpTile7.java:28: error: class mcreator_testenvironmentmodTile7 is public, should be declared in a file named mcreator_testenvironmentmodTile7.java
public class mcreator_testenvironmentmodTile7 {
       ^
F:\apps\Pylo\MCreator175\forge\build\sources\main\java\mod\mcreator\mcreator_brpTile8.java:28: error: class mcreator_testenvironmentmodTile8 is public, should be declared in a file named mcreator_testenvironmentmodTile8.java
public class mcreator_testenvironmentmodTile8 {
       ^
F:\apps\Pylo\MCreator175\forge\build\sources\main\java\mod\mcreator\mcreator_brpTile9.java:28: error: class mcreator_testenvironmentmodTile9 is public, should be declared in a file named mcreator_testenvironmentmodTile9.java
public class mcreator_testenvironmentmodTile9 {
       ^
F:\apps\Pylo\MCreator175\forge\build\sources\main\java\mod\mcreator\TestEnvironmentMod.java:41: error: cannot find symbol
   mcreator_brpTab mcreator_2 = new mcreator_brpTab();
   ^
  symbol:   class mcreator_brpTab
  location: class TestEnvironmentMod
F:\apps\Pylo\MCreator175\forge\build\sources\main\java\mod\mcreator\TestEnvironmentMod.java:42: error: cannot find symbol
   mcreator_brpOvalWindowBrick mcreator_3 = new mcreator_brpOvalWindowBrick();
   ^
  symbol:   class mcreator_brpOvalWindowBrick
  location: class TestEnvironmentMod
F:\apps\Pylo\MCreator175\forge\build\sources\main\java\mod\mcreator\TestEnvironmentMod.java:43: error: cannot find symbol
   mcreator_brpOvalWindow2 mcreator_4 = new mcreator_brpOvalWindow2();
   ^
  symbol:   class mcreator_brpOvalWindow2
  location: class TestEnvironmentMod
F:\apps\Pylo\MCreator175\forge\build\sources\main\java\mod\mcreator\TestEnvironmentMod.java:44: error: cannot find symbol
   mcreator_brpOvalWindowAcacia mcreator_5 = new mcreator_brpOvalWindowAcacia();
   ^
  symbol:   class mcreator_brpOvalWindowAcacia
  location: class TestEnvironmentMod
F:\apps\Pylo\MCreator175\forge\build\sources\main\java\mod\mcreator\TestEnvironmentMod.java:45: error: cannot find symbol
   mcreator_brpOvalWindowAcacia2 mcreator_6 = new mcreator_brpOvalWindowAcacia2();
   ^
  symbol:   class mcreator_brpOvalWindowAcacia2
  location: class TestEnvironmentMod
F:\apps\Pylo\MCreator175\forge\build\sources\main\java\mod\mcreator\TestEnvironmentMod.java:46: error: cannot find symbol
   mcreator_brpOvalWindowBirch mcreator_7 = new mcreator_brpOvalWindowBirch();
   ^
  symbol:   class mcreator_brpOvalWindowBirch
  location: class TestEnvironmentMod
F:\apps\Pylo\MCreator175\forge\build\sources\main\java\mod\mcreator\TestEnvironmentMod.java:47: error: cannot find symbol
   mcreator_brpOvalWindowBirch2 mcreator_8 = new mcreator_brpOvalWindowBirch2();
   ^
  symbol:   class mcreator_brpOvalWindowBirch2
  location: class TestEnvironmentMod
F:\apps\Pylo\MCreator175\forge\build\sources\main\java\mod\mcreator\TestEnvironmentMod.java:48: error: cannot find symbol
   mcreator_brpOvalWindowSpruce mcreator_9 = new mcreator_brpOvalWindowSpruce();
   ^
  symbol:   class mcreator_brpOvalWindowSpruce
  location: class TestEnvironmentMod
F:\apps\Pylo\MCreator175\forge\build\sources\main\java\mod\mcreator\TestEnvironmentMod.java:49: error: cannot find symbol
   mcreator_brpOvalWindowSpruce2 mcreator_10 = new mcreator_brpOvalWindowSpruce2();
   ^
  symbol:   class mcreator_brpOvalWindowSpruce2
  location: class TestEnvironmentMod
F:\apps\Pylo\MCreator175\forge\build\sources\main\java\mod\mcreator\TestEnvironmentMod.java:50: error: cannot find symbol
   mcreator_brpOvalWindowOak mcreator_11 = new mcreator_brpOvalWindowOak();
   ^
  symbol:   class mcreator_brpOvalWindowOak
  location: class TestEnvironmentMod
F:\apps\Pylo\MCreator175\forge\build\sources\main\java\mod\mcreator\TestEnvironmentMod.java:51: error: cannot find symbol
   mcreator_brpOvalWindowOak2 mcreator_12 = new mcreator_brpOvalWindowOak2();
   ^
  symbol:   class mcreator_brpOvalWindowOak2
  location: class TestEnvironmentMod
F:\apps\Pylo\MCreator175\forge\build\sources\main\java\mod\mcreator\TestEnvironmentMod.java:52: error: cannot find symbol
   mcreator_brpOvalWindowBigOak mcreator_13 = new mcreator_brpOvalWindowBigOak();
   ^
  symbol:   class mcreator_brpOvalWindowBigOak
  location: class TestEnvironmentMod
F:\apps\Pylo\MCreator175\forge\build\sources\main\java\mod\mcreator\TestEnvironmentMod.java:53: error: cannot find symbol
   mcreator_brpOvalWindowBigOak2 mcreator_14 = new mcreator_brpOvalWindowBigOak2();
   ^
  symbol:   class mcreator_brpOvalWindowBigOak2
  location: class TestEnvironmentMod
F:\apps\Pylo\MCreator175\forge\build\sources\main\java\mod\mcreator\TestEnvironmentMod.java:54: error: cannot find symbol
   mcreator_brpTile1 mcreator_15 = new mcreator_brpTile1();
   ^
  symbol:   class mcreator_brpTile1
  location: class TestEnvironmentMod
F:\apps\Pylo\MCreator175\forge\build\sources\main\java\mod\mcreator\TestEnvironmentMod.java:55: error: cannot find symbol
   mcreator_brpTile2 mcreator_16 = new mcreator_brpTile2();
   ^
  symbol:   class mcreator_brpTile2
  location: class TestEnvironmentMod
F:\apps\Pylo\MCreator175\forge\build\sources\main\java\mod\mcreator\TestEnvironmentMod.java:56: error: cannot find symbol
   mcreator_brpTile3 mcreator_17 = new mcreator_brpTile3();
   ^
  symbol:   class mcreator_brpTile3
  location: class TestEnvironmentMod
F:\apps\Pylo\MCreator175\forge\build\sources\main\java\mod\mcreator\TestEnvironmentMod.java:57: error: cannot find symbol
   mcreator_brpTile4 mcreator_18 = new mcreator_brpTile4();
   ^
  symbol:   class mcreator_brpTile4
  location: class TestEnvironmentMod
F:\apps\Pylo\MCreator175\forge\build\sources\main\java\mod\mcreator\TestEnvironmentMod.java:58: error: cannot find symbol
   mcreator_brpTile5 mcreator_19 = new mcreator_brpTile5();
   ^
  symbol:   class mcreator_brpTile5
  location: class TestEnvironmentMod
F:\apps\Pylo\MCreator175\forge\build\sources\main\java\mod\mcreator\TestEnvironmentMod.java:59: error: cannot find symbol
   mcreator_brpTile6 mcreator_20 = new mcreator_brpTile6();
   ^
  symbol:   class mcreator_brpTile6
  location: class TestEnvironmentMod
F:\apps\Pylo\MCreator175\forge\build\sources\main\java\mod\mcreator\TestEnvironmentMod.java:60: error: cannot find symbol
   mcreator_brpTile7 mcreator_21 = new mcreator_brpTile7();
   ^
  symbol:   class mcreator_brpTile7
  location: class TestEnvironmentMod
F:\apps\Pylo\MCreator175\forge\build\sources\main\java\mod\mcreator\TestEnvironmentMod.java:61: error: cannot find symbol
   mcreator_brpTile8 mcreator_22 = new mcreator_brpTile8();
   ^
  symbol:   class mcreator_brpTile8
  location: class TestEnvironmentMod
F:\apps\Pylo\MCreator175\forge\build\sources\main\java\mod\mcreator\TestEnvironmentMod.java:62: error: cannot find symbol
   mcreator_brpTile9 mcreator_23 = new mcreator_brpTile9();
   ^
  symbol:   class mcreator_brpTile9
  location: class TestEnvironmentMod
F:\apps\Pylo\MCreator175\forge\build\sources\main\java\mod\mcreator\TestEnvironmentMod.java:63: error: cannot find symbol
   mcreator_brpTile10 mcreator_24 = new mcreator_brpTile10();
   ^
  symbol:   class mcreator_brpTile10
  location: class TestEnvironmentMod
F:\apps\Pylo\MCreator175\forge\build\sources\main\java\mod\mcreator\TestEnvironmentMod.java:64: error: cannot find symbol
   mcreator_brpTile11 mcreator_25 = new mcreator_brpTile11();
   ^
  symbol:   class mcreator_brpTile11
  location: class TestEnvironmentMod
F:\apps\Pylo\MCreator175\forge\build\sources\main\java\mod\mcreator\TestEnvironmentMod.java:65: error: cannot find symbol
   mcreator_brpTile12 mcreator_26 = new mcreator_brpTile12();
   ^
  symbol:   class mcreator_brpTile12
  location: class TestEnvironmentMod
F:\apps\Pylo\MCreator175\forge\build\sources\main\java\mod\mcreator\TestEnvironmentMod.java:66: error: cannot find symbol
   mcreator_brpTile13 mcreator_27 = new mcreator_brpTile13();
   ^
  symbol:   class mcreator_brpTile13
  location: class TestEnvironmentMod
F:\apps\Pylo\MCreator175\forge\build\sources\main\java\mod\mcreator\TestEnvironmentMod.java:67: error: cannot find symbol
   mcreator_brpTile14 mcreator_28 = new mcreator_brpTile14();
   ^
  symbol:   class mcreator_brpTile14
  location: class TestEnvironmentMod
F:\apps\Pylo\MCreator175\forge\build\sources\main\java\mod\mcreator\TestEnvironmentMod.java:41: error: cannot find symbol
   mcreator_brpTab mcreator_2 = new mcreator_brpTab();
                                    ^
  symbol:   class mcreator_brpTab
  location: class TestEnvironmentMod
F:\apps\Pylo\MCreator175\forge\build\sources\main\java\mod\mcreator\TestEnvironmentMod.java:42: error: cannot find symbol
   mcreator_brpOvalWindowBrick mcreator_3 = new mcreator_brpOvalWindowBrick();
                                                ^
  symbol:   class mcreator_brpOvalWindowBrick
  location: class TestEnvironmentMod
F:\apps\Pylo\MCreator175\forge\build\sources\main\java\mod\mcreator\TestEnvironmentMod.java:43: error: cannot find symbol
   mcreator_brpOvalWindow2 mcreator_4 = new mcreator_brpOvalWindow2();
                                            ^
  symbol:   class mcreator_brpOvalWindow2
  location: class TestEnvironmentMod
F:\apps\Pylo\MCreator175\forge\build\sources\main\java\mod\mcreator\TestEnvironmentMod.java:44: error: cannot find symbol
   mcreator_brpOvalWindowAcacia mcreator_5 = new mcreator_brpOvalWindowAcacia();
                                                 ^
  symbol:   class mcreator_brpOvalWindowAcacia
  location: class TestEnvironmentMod
F:\apps\Pylo\MCreator175\forge\build\sources\main\java\mod\mcreator\TestEnvironmentMod.java:45: error: cannot find symbol
   mcreator_brpOvalWindowAcacia2 mcreator_6 = new mcreator_brpOvalWindowAcacia2();
                                                  ^
  symbol:   class mcreator_brpOvalWindowAcacia2
  location: class TestEnvironmentMod
:compileJava FAILED
F:\apps\Pylo\MCreator175\forge\build\sources\main\java\mod\mcreator\TestEn: error: cannot find symbol
vironmentMod.java:46   mcreator_brpOvalWindowBirch mcreator_7 = new mcreator_brpOvalWindowBirch();
BUILD FAILED
Total time: 8.592 secs
                                                ^
  symbol:   class mcreator_brpOvalWindowBirch
  location: class TestEnvironmentMod
F:\apps\Pylo\MCreator175\forge\build\sources\main\java\mod\mcreator\TestEnvironmentMod.java:47: error: cannot find symbol
   mcreator_brpOvalWindowBirch2 mcreator_8 = new mcreator_brpOvalWindowBirch2();
                                                 ^
  symbol:   class mcreator_brpOvalWindowBirch2
  location: class TestEnvironmentMod
F:\apps\Pylo\MCreator175\forge\build\sources\main\java\mod\mcreator\TestEnvironmentMod.java:48: error: cannot find symbol
   mcreator_brpOvalWindowSpruce mcreator_9 = new mcreator_brpOvalWindowSpruce();
                                                 ^
  symbol:   class mcreator_brpOvalWindowSpruce
  location: class TestEnvironmentMod
F:\apps\Pylo\MCreator175\forge\build\sources\main\java\mod\mcreator\TestEnvironmentMod.java:49: error: cannot find symbol
   mcreator_brpOvalWindowSpruce2 mcreator_10 = new mcreator_brpOvalWindowSpruce2();
                                                   ^
  symbol:   class mcreator_brpOvalWindowSpruce2
  location: class TestEnvironmentMod
F:\apps\Pylo\MCreator175\forge\build\sources\main\java\mod\mcreator\TestEnvironmentMod.java:50: error: cannot find symbol
   mcreator_brpOvalWindowOak mcreator_11 = new mcreator_brpOvalWindowOak();
                                               ^
  symbol:   class mcreator_brpOvalWindowOak
  location: class TestEnvironmentMod
F:\apps\Pylo\MCreator175\forge\build\sources\main\java\mod\mcreator\TestEnvironmentMod.java:51: error: cannot find symbol
   mcreator_brpOvalWindowOak2 mcreator_12 = new mcreator_brpOvalWindowOak2();
                                                ^
  symbol:   class mcreator_brpOvalWindowOak2
  location: class TestEnvironmentMod
F:\apps\Pylo\MCreator175\forge\build\sources\main\java\mod\mcreator\TestEnvironmentMod.java:52: error: cannot find symbol
   mcreator_brpOvalWindowBigOak mcreator_13 = new mcreator_brpOvalWindowBigOak();
                                                  ^
  symbol:   class mcreator_brpOvalWindowBigOak
  location: class TestEnvironmentMod
F:\apps\Pylo\MCreator175\forge\build\sources\main\java\mod\mcreator\TestEnvironmentMod.java:53: error: cannot find symbol
   mcreator_brpOvalWindowBigOak2 mcreator_14 = new mcreator_brpOvalWindowBigOak2();
                                                   ^
  symbol:   class mcreator_brpOvalWindowBigOak2
  location: class TestEnvironmentMod
F:\apps\Pylo\MCreator175\forge\build\sources\main\java\mod\mcreator\TestEnvironmentMod.java:54: error: cannot find symbol
   mcreator_brpTile1 mcreator_15 = new mcreator_brpTile1();
                                       ^
  symbol:   class mcreator_brpTile1
  location: class TestEnvironmentMod
F:\apps\Pylo\MCreator175\forge\build\sources\main\java\mod\mcreator\TestEnvironmentMod.java:55: error: cannot find symbol
   mcreator_brpTile2 mcreator_16 = new mcreator_brpTile2();
                                       ^
  symbol:   class mcreator_brpTile2
  location: class TestEnvironmentMod
F:\apps\Pylo\MCreator175\forge\build\sources\main\java\mod\mcreator\TestEnvironmentMod.java:56: error: cannot find symbol
   mcreator_brpTile3 mcreator_17 = new mcreator_brpTile3();
                                       ^
  symbol:   class mcreator_brpTile3
  location: class TestEnvironmentMod
F:\apps\Pylo\MCreator175\forge\build\sources\main\java\mod\mcreator\TestEnvironmentMod.java:57: error: cannot find symbol
   mcreator_brpTile4 mcreator_18 = new mcreator_brpTile4();
                                       ^
F:\apps\Pylo\MCreator175\forge>
  sy  location: class TestEnvironmentMod
mbol:   class mcreator_brpTile4
F:\apps\Pylo\MCreator175\forge\build\sources\main\java\mod\mcreator\TestEnvironmentMod.java:58Task completed with return code 0 in 8973 milliseconds
: error: cannot find symbol
   mcreator_brpTile5 mcreator_19 = new mcreator_brpTile5();
                                       ^
  symbol:   class mcreator_brpTile5
  location: class TestEnvironmentMod
F:\apps\Pylo\MCreator175\forge\build\sources\main\java\mod\mcreator\TestEnvironmentMod.java:59: error: cannot find symbol
   mcreator_brpTile6 mcreator_20 = new mcreator_brpTile6();
                                       ^
  symbol:   class mcreator_brpTile6
  location: class TestEnvironmentMod
F:\apps\Pylo\MCreator175\forge\build\sources\main\java\mod\mcreator\TestEnvironmentMod.java:60: error: cannot find symbol
   mcreator_brpTile7 mcreator_21 = new mcreator_brpTile7();
                                       ^
  symbol:   class mcreator_brpTile7
  location: class TestEnvironmentMod
F:\apps\Pylo\MCreator175\forge\build\sources\main\java\mod\mcreator\TestEnvironmentMod.java:61: error: cannot find symbol
   mcreator_brpTile8 mcreator_22 = new mcreator_brpTile8();
                                       ^
  symbol:   class mcreator_brpTile8
  location: class TestEnvironmentMod
F:\apps\Pylo\MCreator175\forge\build\sources\main\java\mod\mcreator\TestEnvironmentMod.java:62: error: cannot find symbol
   mcreator_brpTile9 mcreator_23 = new mcreator_brpTile9();
                                       ^
  symbol:   class mcreator_brpTile9
  location: class TestEnvironmentMod
F:\apps\Pylo\MCreator175\forge\build\sources\main\java\mod\mcreator\TestEnvironmentMod.java:63: error: cannot find symbol
   mcreator_brpTile10 mcreator_24 = new mcreator_brpTile10();
                                        ^
  symbol:   class mcreator_brpTile10
  location: class TestEnvironmentMod
F:\apps\Pylo\MCreator175\forge\build\sources\main\java\mod\mcreator\TestEnvironmentMod.java:64: error: cannot find symbol
   mcreator_brpTile11 mcreator_25 = new mcreator_brpTile11();
                                        ^
  symbol:   class mcreator_brpTile11
  location: class TestEnvironmentMod
F:\apps\Pylo\MCreator175\forge\build\sources\main\java\mod\mcreator\TestEnvironmentMod.java:65: error: cannot find symbol
   mcreator_brpTile12 mcreator_26 = new mcreator_brpTile12();
                                        ^
  symbol:   class mcreator_brpTile12
  location: class TestEnvironmentMod
F:\apps\Pylo\MCreator175\forge\build\sources\main\java\mod\mcreator\TestEnvironmentMod.java:66: error: cannot find symbol
   mcreator_brpTile13 mcreator_27 = new mcreator_brpTile13();
                                        ^
  symbol:   class mcreator_brpTile13
  location: class TestEnvironmentMod
F:\apps\Pylo\MCreator175\forge\build\sources\main\java\mod\mcreator\TestEnvironmentMod.java:67: error: cannot find symbol
   mcreator_brpTile14 mcreator_28 = new mcreator_brpTile14();
                                        ^
  symbol:   class mcreator_brpTile14
  location: class TestEnvironmentMod
F:\apps\Pylo\MCreator175\forge\build\sources\main\java\mod\mcreator\mcreator_brpPaintBrick1.java:63: error: cannot find symbol
            .setUnlocalizedName("BrpPaintBrick1").setLightOpacity(0).setCreativeTab(mcreator_brpTab.tab));
                                                                                    ^
  symbol:   variable mcreator_brpTab
  location: class mcreator_brpPaintBrick1
82 errors
FAILURE: Build failed with an exception.
* What went wrong:
Execution failed for task ':compileJava'.
> Compilation failed; see the compiler error output for details.
* Try:
Run with --stacktrace option to get the stack trace. Run with --info or --debug option to get more log output.

[/spoiler]

Last seen on 08:40, 25. Mar 2018
Joined Apr 2017
User points:

Statistics:

  • Comments:
  • Forum topics:
  • Modifications:
  • Wiki pages:
Another piece of data. If I
Wed, 04/26/2017 - 14:03

Another piece of data. If I export my current "broken" workspace to an .MCR file, and then re-import it into a new workspace, it compiles fine.

Last seen on 08:40, 25. Mar 2018
Joined Apr 2017
User points:

Statistics:

  • Comments:
  • Forum topics:
  • Modifications:
  • Wiki pages:
This is really becoming
Thu, 04/27/2017 - 15:53

This is really becoming problematic as the size of my mod is growing more complex every day. Every time I make even the slightest change to an existing mod, it is breaking the workspace, and I have to do the export/import workaround.... :(

Last seen on 08:40, 25. Mar 2018
Joined Apr 2017
User points:

Statistics:

  • Comments:
  • Forum topics:
  • Modifications:
  • Wiki pages:
Is there someway to perhaps
Thu, 04/27/2017 - 16:09

Is there someway to perhaps disable the test environment build-related stuff? That seems to be what it keeps choking on. I don't use the test environment - I just deploy to a separate MC.

Last seen on 08:40, 25. Mar 2018
Joined Apr 2017
User points:

Statistics:

  • Comments:
  • Forum topics:
  • Modifications:
  • Wiki pages:
Ok, I've made some progress
Fri, 04/28/2017 - 00:45

Ok, I've made some progress in debugging what is causing the issue.

It seems to happen after I click the build/compile button manually. If I just let MCreator do the auto-build after making a change, I haven't noticed the problem. But basically, when I click the manual build icon at the top of the app, it turns this code:

[spoiler]

...
import java.util.Random;

public class mcreator_brpLargeTableDarkOak {

    public mcreator_brpLargeTableDarkOak() {
    }

    ...

}

[/spoiler]

To this:

[spoiler]

import java.util.Random;

public class mcreator_testenvironmentmodEndTableDarkOak {

    public mcreator_testenvironmentmodEndTableDarkOak() {
    }

     ....

    static class BlockBrpEndTableDarkOak extends Block {

    ....

[/spoiler]

MCreator is munging things up I think. Hope this helps!

Last seen on 08:40, 25. Mar 2018
Joined Apr 2017
User points:

Statistics:

  • Comments:
  • Forum topics:
  • Modifications:
  • Wiki pages:
UPDATE: It also happens in
Fri, 04/28/2017 - 01:33

UPDATE: It also happens in the first build after you click the export to ZIP/JAR option at the top of the app menu. That build runs fine, but the first time you autobuild after that, you get the error. Not sure if it happens when you try it from the left/vertical menu buttons or not, though.

Last seen on 08:40, 25. Mar 2018
Joined Apr 2017
User points:

Statistics:

  • Comments:
  • Forum topics:
  • Modifications:
  • Wiki pages:
Hoping a dev will chime in on
Fri, 04/28/2017 - 17:10

Hoping a dev will chime in on this thread at some point .... ? :D

Last seen on 08:40, 25. Mar 2018
Joined Apr 2017
User points:

Statistics:

  • Comments:
  • Forum topics:
  • Modifications:
  • Wiki pages:
I thought that locking the
Mon, 05/01/2017 - 07:05

I thought that locking the code for all of my blocks would be a good workaround for the issues I've described here. So, I locked the code for ALL of my blocks, did a build and deployed. Everything seemed fine. Immediately went back to do a manual build again, and get errors because the code is munged as described above. So locking the code doesn't really protect it fully as it stands right now.