Gradle Error when installing MCreator

Started by shawne11 on Sun, 07/16/2017 - 14:05

Topic category: Help with MCreator software

Last seen on 16:18, 21. Jan 2019
Joined Oct 2014
User points:

User statistics:

  • Modifications:
  • Forum topics:
  • Wiki pages:
  • Tracker tickets:
  • MCreator plugins:
  • Comments:
Gradle Error when installing MCreator
Sun, 07/16/2017 - 14:05

This is the error i got when installing mcreator

   
Executing gradle command: cleanCache clean setupDecompWorkspace --refresh-dependencies
Microsoft Windows [Version 6.3.9600]
(c) 2013 Microsoft Corporation. All rights reserved.
C:\Pylo\MCreator175>cd forge
C:\Pylo\MCreator175\forge>SET "JAVA_HOME=C:\Pylo\MCreator175\jdk32\"
C:\Pylo\MCreator175\forge>SET JAVA_EXE=%JAVA_HOME%\bin\java.exe
C:\Pylo\MCreator175\forge>SET PATH=%JAVA_HOME%\bin\;%PATH%
C:\Pylo\MCreator175\forge>gradlew -Dorg.gradle.jvmargs="-Xms512m -Xmx1024m" cleanCache clean setupDecompWorkspace --refresh-dependencies 
This mapping 'snapshot_20161220' was designed for MC 1.11! Use at your own peril.
#################################################
         ForgeGradle 2.2-SNAPSHOT-f0ba31b        
  https://github.com/MinecraftForge/ForgeGradle  
#################################################
               Powered by MCP unknown               
             http://modcoderpack.com             
         by: Searge, ProfMobius, Fesh0r,         
         R4wk, ZeuX, IngisKahn, bspkrs           
#################################################
:cleanCache
:clean UP-TO-DATE
:deobfCompileDummyTask
:deobfProvidedDummyTask
:getVersionJson
:extractUserdev
:extractDependencyATs SKIPPED
:extractMcpData
:extractMcpMappings
:genSrgs
:downloadClient
:downloadServer
:splitServerJar
:mergeJars
:deobfMcSRG
Applying SpecialSource...
Applying Exceptor...
:decompileMc
Download https://repo1.maven.org/maven2/org/apache/logging/log4j/log4j-api/2.0-b…
Download https://repo1.maven.org/maven2/org/apache/logging/log4j/log4j-core/2.0-…
Download https://libraries.minecraft.net/net/minecraft/launchwrapper/1.12/launch…
Download https://repo1.maven.org/maven2/jline/jline/2.13/jline-2.13.jar
Download https://repo1.maven.org/maven2/org/ow2/asm/asm-debug-all/5.0.3/asm-debu…
Download https://repo1.maven.org/maven2/com/typesafe/akka/akka-actor_2.11/2.3.3/…
Download https://repo1.maven.org/maven2/com/typesafe/config/1.2.1/config-1.2.1.j…
Download https://repo1.maven.org/maven2/org/scala-lang/scala-actors-migration_2…
Download https://repo1.maven.org/maven2/org/scala-lang/scala-compiler/2.11.1/sca…
Download https://repo1.maven.org/maven2/org/scala-lang/plugins/scala-continuatio…
Download https://repo1.maven.org/maven2/org/scala-lang/plugins/scala-continuatio…
Download https://repo1.maven.org/maven2/org/scala-lang/scala-library/2.11.1/scal…
Download https://repo1.maven.org/maven2/org/scala-lang/modules/scala-parser-comb…
Download https://repo1.maven.org/maven2/org/scala-lang/scala-reflect/2.11.1/scal…
Download https://repo1.maven.org/maven2/org/scala-lang/modules/scala-swing_2.11/…
:decompileMc FAILED
FAILURE: Build failed with an exception.
BUILD FAILED
* WhatExecution faiTotal time: 3 mins 18.284 secs
led for task ':decompileMc'.
 went wrong:
> Could not resolve all dependencies for configuration ':forgeGradleMcDeps'.
> Could not download scala-swing_2.11.jar (org.scala-lang.modules:scala-swing_2.11:1.0.1)
> Could not get resource 'https://repo1.maven.org/maven2/org/scala-lang/modules/scala-swing_2.11/…;.
> Failed to move file 'C:\Users\rashawn\AppData\Local\Temp\gradle_download7636741637586403971bin' into filestore at 'C:\Users\rashawn\.gradle\caches\modules-2\files-2.1\org.scala-lang.modules\scala-swing_2.11\1.0.1\b1cdd92bd47b1e1837139c1c53020e86bb9112ae\scala-swing_2.11-1.0.1.jar' 
* Try:
Run with --stacktrace option to get the stack trace. Run with --info or --debug option to get more log output.
C:\Pylo\MCreator175\forge>
Task completed with return code 0 in 201156 milliseconds

Anyone know what this means or how i can fix this?

Thanks

Last seen on 16:14, 16. Jul 2017
Joined Jun 2017
User points:

User statistics:

  • Modifications:
  • Forum topics:
  • Wiki pages:
  • Tracker tickets:
  • MCreator plugins:
  • Comments:
Welp i dont know how to fix
Sun, 07/16/2017 - 16:08

Welp i dont know how to fix this but it happend to me too with the EXACT SAME ERROR CODE are you on windows 8/8.1?

Last seen on 16:14, 16. Jul 2017
Joined Jun 2017
User points:

User statistics:

  • Modifications:
  • Forum topics:
  • Wiki pages:
  • Tracker tickets:
  • MCreator plugins:
  • Comments:
Maybe it was the part that
Sun, 07/16/2017 - 16:10

Maybe it was the part that was 

 

 

 

 

 

 

:extractDependencyATs SKIPPED

Last seen on 16:14, 16. Jul 2017
Joined Jun 2017
User points:

User statistics:

  • Modifications:
  • Forum topics:
  • Wiki pages:
  • Tracker tickets:
  • MCreator plugins:
  • Comments:
Wait 
Sun, 07/16/2017 - 16:11

Wait 

 

MCreator requires at least these specifications of the computer in order to work without crashes, glitches or unusual bugs. When user for example tests the mod, Minecraft instance, MCreator gradle process and the MCreator itself are running so a decent computer is a must.

Minimal specifications:

  • Windows XP SP3/Vista/7/8/8.1/10 or Linux (with >2.6 kernel) Ubuntu/Debian/... or OSX Leopard or higher
  • 2 GB of DDR3 RAM (4GB or more of DDR3 RAM for 64 bit edition)
  • 2 core CPU Intel/AMD
  • 280 MB of storage
  • Reliable internet connection

Recommended specifications:

  • Windows XP SP3/Vista/7/8/8.1/10 or Linux (with >2.6 kernel) Ubuntu/Debian/... or OSX Leopard or higher
  • 4 GB (or more, 8GB recommended for the 64 bit edition) of DDR3(or higher) RAM
  • 4 core (or more) CPU Intel/AMD
  • 500 MB (or more) of storage
  • Reliable internet connection

If your system runs in 64 bit mode and the desired version of MCreator has separate 64 bit edition, it is wise to use it as MCreator will be able to allocate more memory and therefore run much better and smoother. Linux and Mac editions are made to work and adapt on both 64 and 32 bit operating system.

Last seen on 16:14, 16. Jul 2017
Joined Jun 2017
User points:

User statistics:

  • Modifications:
  • Forum topics:
  • Wiki pages:
  • Tracker tickets:
  • MCreator plugins:
  • Comments:
You might need to run it as
Sun, 07/16/2017 - 16:14

You might need to run it as administrator if you get stuck on Building forge or if MCreator setup is complete in less then a minute.

 

or just download like a trillion times 

Last seen on 15:38, 20. Jul 2017
Joined Apr 2017
User points:

User statistics:

  • Modifications:
  • Forum topics:
  • Wiki pages:
  • Tracker tickets:
  • MCreator plugins:
  • Comments:
The exact same thing happened
Sun, 07/16/2017 - 19:16

The exact same thing happened to me but I fixed it I don't remember how :(

Last seen on 10:39, 5. Aug 2019
Joined Jun 2017
User points:

User statistics:

  • Modifications:
  • Forum topics:
  • Wiki pages:
  • Tracker tickets:
  • MCreator plugins:
  • Comments:
If you're having problems
Sun, 07/16/2017 - 19:22

If you're having problems with the second (or third, I can't remember which) step of the installation process, have you tried installing another bit version? Eg. 32, 64-bit? That worked for me.

Last seen on 15:38, 20. Jul 2017
Joined Apr 2017
User points:

User statistics:

  • Modifications:
  • Forum topics:
  • Wiki pages:
  • Tracker tickets:
  • MCreator plugins:
  • Comments:
Go to https://repo1.maven.org
Sun, 07/16/2017 - 19:22

Go to https://repo1.maven.org/maven2/org/scala-lang/modules/scala-swing_2.11/…

and put it here:

C:\Users\your-username\.gradle\caches\modules-2\files-2.1\org.scala-lang.modules\scala-swing_2.11\1.0.1\b1cdd92bd47b1e1837139c1c53020e86bb9112ae

 

Then try to run installation again :)

Last seen on 18:34, 23. Dec 2017
Joined Jun 2017
User points:

User statistics:

  • Modifications:
  • Forum topics:
  • Wiki pages:
  • Tracker tickets:
  • MCreator plugins:
  • Comments:
but i have this file   
Sat, 12/23/2017 - 08:03

but i have this file