Mod exporting failed...

Started by proxerater on Fri, 08/03/2018 - 19:02

Topic category: Help with MCreator software

Last seen on 08:33, 15. Jul 2021
Joined Mar 2014
Points:

User statistics:

  • Modifications:
  • Forum topics:
  • Wiki pages:
  • Tracker tickets:
  • MCreator plugins:
  • Comments:
Mod exporting failed...
Fri, 08/03/2018 - 19:02

My mod exporting didn't end well. Heres the log. Took a while to write out.

:clean FAILED
FAILURE: Build failed with an exception.
* What went wrong:
Execution failed for task ':clean'.
> Unable to delete this file: C:\Pylo\MCreator179\forge\build\libs\modid-1.0.jar
* Try:
Run with --stacktrace option to get the stack trace. Run with --info or --debug option to get more log output.
BUILD FAILED

 

Please help me, or i cannot create KrayR.

A computer reboot should…
Fri, 08/03/2018 - 20:29

A computer reboot should help, if it does not, try to manually remove the file  C:\Pylo\MCreator179\forge\build\libs\modid-1.0.jar and recompile again.

Last seen on 08:33, 15. Jul 2021
Joined Mar 2014
Points:

User statistics:

  • Modifications:
  • Forum topics:
  • Wiki pages:
  • Tracker tickets:
  • MCreator plugins:
  • Comments:
Thank you so much Klemen. <3
Fri, 08/03/2018 - 22:06

Thank you so much Klemen. <3

Last seen on 15:53, 27. Nov 2022
Joined Nov 2022
Points:

User statistics:

  • Modifications:
  • Forum topics:
  • Wiki pages:
  • Tracker tickets:
  • MCreator plugins:
  • Comments:
PLEASE HELP:- FAILURE: Build…
Wed, 11/23/2022 - 15:53

PLEASE HELP:-

FAILURE: Build failed with an exception.
* What went wrong:
A problem occurred configuring root project 'first_mod'.
> java.util.concurrent.ExecutionException: org.gradle.api.GradleException: Failed to create Jar file C:\Users\Shantanu Raj\.mcreator\gradle\caches\jars-9\81f79dee6328f70a0ed0102c84ff3819\ForgeGradle-5.1.58.jar.
* Try:
Run with --stacktrace option to get the stack trace. Run with --info or --debug option to get more log output. Run with --scan to get full insights.
* Get more help at https://help.gradle.org
BUILD FAILED in 43s

BUILD FAILED