ERROR! i've tried everything! help!

Started by Embolical on Mon, 08/27/2018 - 23:00

Topic category: Help with MCreator software

Last seen on 05:41, 18. May 2019
Joined May 2018
User points:

User statistics:

  • Modifications:
  • Forum topics:
  • Wiki pages:
  • Tracker tickets:
  • MCreator plugins:
  • Comments:
ERROR! i've tried everything! help!
Tue, 08/28/2018 - 06:23 (edited)
C:\Pylo\MCreator179\forge\build\sources\main\java\mod\mcreator\beta1.java:42: error: cannot find symbol
	mcreator_milkmoo mcreator_7 = new mcreator_milkmoo();
	^
  symbol:   class mcreator_milkmoo
  location: class beta1
C:\Pylo\MCreator179\forge\build\sources\main\java\mod\mcreator\beta1.java:43: error: cannot find symbol
	mcreator_placemilk mcreator_8 = new mcreator_placemilk();
	^
  symbol:   class mcreator_placemilk
  location: class beta1
C:\Pylo\MCreator179\forge\build\sources\main\java\mod\mcreator\beta1.java:44: error: cannot find symbol
	mcreator_rubyArmor mcreator_9 = new mcreator_rubyArmor();
	^
  symbol:   class mcreator_rubyArmor
  location: class beta1
C:\Pylo\MCreator179\forge\build\sources\main\java\mod\mcreator\beta1.java:45: error: cannot find symbol
	mcreator_make1 mcreator_10 = new mcreator_make1();
	^
  symbol:   class mcreator_make1
  location: class beta1
C:\Pylo\MCreator179\forge\build\sources\main\java\mod\mcreator\beta1.java:46: error: cannot find symbol
	mcreator_make2 mcreator_11 = new mcreator_make2();
	^
  symbol:   class mcreator_make2
  location: class beta1
C:\Pylo\MCreator179\forge\build\sources\main\java\mod\mcreator\beta1.java:47: error: cannot find symbol
	mcreator_make3 mcreator_12 = new mcreator_make3();
	^
  symbol:   class mcreator_make3
  location: class beta1
C:\Pylo\MCreator179\forge\build\sources\main\java\mod\mcreator\beta1.java:48: error: cannot find symbol
	mcreator_make4 mcreator_13 = new mcreator_make4();
	^
  symbol:   class mcreator_make4
  location: class beta1
C:\Pylo\MCreator179\forge\build\sources\main\java\mod\mcreator\beta1.java:49: error: cannot find symbol
	mcreator_make5 mcreator_14 = new mcreator_make5();
	^
  symbol:   class mcreator_make5
  location: class beta1
C:\Pylo\MCreator179\forge\build\sources\main\java\mod\mcreator\beta1.java:50: error: cannot find symbol
	mcreator_make6 mcreator_15 = new mcreator_make6();
	^
  symbol:   class mcreator_make6
  location: class beta1
C:\Pylo\MCreator179\forge\build\sources\main\java\mod\mcreator\beta1.java:51: error: cannot find symbol
	mcreator_make7 mcreator_16 = new mcreator_make7();
	^
  symbol:   class mcreator_make7
  location: class beta1
C:\Pylo\MCreator179\forge\build\sources\main\java\mod\mcreator\beta1.java:52: error: cannot find symbol
	mcreator_blackMold mcreator_17 = new mcreator_blackMold();
	^
  symbol:   class mcreator_blackMold
  location: class beta1
C:\Pylo\MCreator179\forge\build\sources\main\java\mod\mcreator\beta1.java:53: error: cannot find symbol
	mcreator_middleMan mcreator_18 = new mcreator_middleMan();
	^
  symbol:   class mcreator_middleMan
  location: class beta1
C:\Pylo\MCreator179\forge\build\sources\main\java\mod\mcreator\beta1.java:54: error: cannot find symbol
	mcreator_middlemanuse mcreator_19 = new mcreator_middlemanuse();
	^
  symbol:   class mcreator_middlemanuse
  location: class beta1
C:\Pylo\MCreator179\forge\build\sources\main\java\mod\mcreator\beta1.java:55: error: cannot find symbol
	mcreator_make8 mcreator_20 = new mcreator_make8();
	^
  symbol:   class mcreator_make8
  location: class beta1
C:\Pylo\MCreator179\forge\build\sources\main\java\mod\mcreator\beta1.java:56: error: cannot find symbol
	mcreator_superPlate mcreator_21 = new mcreator_superPlate();
	^
  symbol:   class mcreator_superPlate
  location: class beta1
15 errors

FAILURE: Build failed with an exception.

* What went wrong:
Execution failed for task ':compileJava'.
> Compilation failed; see the compiler error output for details.

* Try:
Run with --stacktrace option to get the stack trace. Run with --info or --debug option to get more log output.

Hey, so I have been working on a ruby type mod and have added some items! they are really good and I love them! BUT whenever I now go to export/recompile it; it now says that the recompile failed or something and it gives no problematic mods listed, at first I thought it was my mob that I modeled but after removing him it still said the same thing, I have been googling this for about an hour and nothing has helped fix my issue, here is the gradle error log.

Edited by Embolical on Tue, 08/28/2018 - 06:23
Last seen on 05:41, 18. May 2019
Joined May 2018
User points:

User statistics:

  • Modifications:
  • Forum topics:
  • Wiki pages:
  • Tracker tickets:
  • MCreator plugins:
  • Comments:
bout to give up and never…
Tue, 08/28/2018 - 06:26

bout to give up and never make mods again, this is just terrible, at least enable people to EXPORT their mods after 2+ items are added... jeez and this has been a glitch for ages, I've been through all my files all the code all the outputs changed versions restarted everything multiple times deleted things like cache several times and STILL the same output... FIX. THIS. IN. THE. NEXT. UPDATE.

Last seen on 23:23, 12. Jun 2020
Joined May 2016
User points:

User statistics:

  • Modifications:
  • Forum topics:
  • Wiki pages:
  • Tracker tickets:
  • MCreator plugins:
  • Comments:
Did you edit the code at all…
Tue, 08/28/2018 - 11:07

Did you edit the code at all, or did you create it through the MCreator creation tools? And did it work at a certain point and then stop working, or did it just not work entirely?

Last seen on 10:11, 21. Oct 2020
Joined Apr 2010
User points:

User statistics:

  • Modifications:
  • Forum topics:
  • Wiki pages:
  • Tracker tickets:
  • MCreator plugins:
  • Comments:
Try to select another…
Tue, 08/28/2018 - 16:40

Try to select another workspace and then the first workspace back. This will fix this bug.