cant setup

Started by kingmirak12 on Tue, 02/11/2020 - 00:52

Topic category: General discussion

Last seen on 23:34, 11. Feb 2020
Joined Aug 2017
User points:

User statistics:

  • Modifications:
  • Forum topics:
  • Wiki pages:
  • Tracker tickets:
  • Comments:
cant setup
Tue, 02/11/2020 - 00:52

it shows this every time I need to set it up

 

 

Executing gradle task: eclipse
Build info: MCreator 2020.1.05419, 1.14.4, 64-bit, 7107 MB, Windows 10, JVM 1.8.0_232, JAVA_HOME: C:\Users\Owner\Pictures\Ethan\minecraft\mods\MCreator\jdk
FAILURE: Build failed with an exception.
* What went wrong:
A problem occurred configuring root project 'charg'.
> Could not resolve all artifacts for configuration ':classpath'.
> Could not resolve net.minecraftforge.gradle:ForgeGradle:3.+.
Required by:
project :
> Failed to list versions for net.minecraftforge.gradle:ForgeGradle.
> Unable to load Maven meta-data from https://files.minecraftforge.net/maven/net/minecraftforge/gradle/ForgeG….
> Could not get resource 'https://files.minecraftforge.net/maven/net/minecraftforge/gradle/ForgeG…'.
> Could not GET 'https://files.minecraftforge.net/maven/net/minecraftforge/gradle/ForgeG…'.
> sun.security.validator.ValidatorException: PKIX path building failed: sun.security.provider.certpath.SunCertPathBuilderException: unable to find valid certification path to requested target
* Try:
Run with --stacktrace option to get the stack trace. Run with --info or --debug option to get more log output. Run with --scan to get full insights.
* Get more help at https://help.gradle.org
BUILD FAILED in 2s
BUILD FAILED

Executing gradle task: eclipse
Build info: MCreator 2020.1.05419, 1.14.4, 64-bit, 7107 MB, Windows 10, JVM 1.8.0_232, JAVA_HOME: C:\Users\Owner\Pictures\Ethan\minecraft\mods\MCreator\jdk
FAILURE: Build failed with an exception.
* What went wrong:
A problem occurred configuring root project 'charg'.
> Could not resolve all artifacts for configuration ':classpath'.
> Could not resolve net.minecraftforge.gradle:ForgeGradle:3.+.
Required by:
project :
> Failed to list versions for net.minecraftforge.gradle:ForgeGradle.
> Unable to load Maven meta-data from https://files.minecraftforge.net/maven/net/minecraftforge/gradle/ForgeG….
> Could not get resource 'https://files.minecraftforge.net/maven/net/minecraftforge/gradle/ForgeG…'.
> Could not GET 'https://files.minecraftforge.net/maven/net/minecraftforge/gradle/ForgeG…'.
> sun.security.validator.ValidatorException: PKIX path building failed: sun.security.provider.certpath.SunCertPathBuilderException: unable to find valid certification path to requested target
* Try:
Run with --stacktrace option to get the stack trace. Run with --info or --debug option to get more log output. Run with --scan to get full insights.
* Get more help at https://help.gradle.org
BUILD FAILED in 1s
BUILD FAILED

The solution to this problem…
Tue, 02/11/2020 - 17:21

The solution to this problem and many other problems can be found in our knowledge base: https://mcreator.net/support/knowledgebase Please check the knowledge base before opening a new topic on the issue which has a known fix.