I can't test my mod

Started by Marticraft on Sat, 07/18/2020 - 04:49

Topic category: Troubleshooting, bugs, and solutions

Last seen on 14:16, 1. Aug 2020
Joined Jul 2020
Points:

User statistics:

  • Modifications:
  • Forum topics:
  • Wiki pages:
  • Tracker tickets:
  • MCreator plugins:
  • Comments:
I can't test my mod
Sat, 07/18/2020 - 04:49

help!! When making a mod and testing it, an error appeared that brought this:

> Task :runClient FAILED
FAILURE: Build failed with an exception.
* What went wrong:
Execution failed for task ':runClient'.
> Process 'command 'C:\Program Files\Pylo\MCreator\jdk\bin\java.exe'' finished with non-zero exit value 1
* Try:
Run with --stacktrace option to get the stack trace. Run with --info or --debug option to get more log output. Run with --scan to get full insights.
* Get more help at https://help.gradle.org
Deprecated Gradle features were used in this build, making it incompatible with Gradle 5.0.
Use '--warning-mode all' to show the individual deprecation warnings.
See https://docs.gradle.org/4.10.3/userguide/command_line_interface.html#se…
BUILD FAILED in 40s
10 actionable tasks: 4 executed, 6 up-to-date
BUILD FAILED
Task completed in 40459 milliseconds

what I do?

Last seen on 09:08, 21. Aug 2020
Joined Jun 2020
Points:

User statistics:

  • Modifications:
  • Forum topics:
  • Wiki pages:
  • Tracker tickets:
  • MCreator plugins:
  • Comments:
Try creating new workspace…
Tue, 07/21/2020 - 08:54

Try creating new workspace and import producres,textures,blocks,items and models from the current one

Last seen on 18:50, 9. Jun 2021
Joined May 2016
Points:

User statistics:

  • Modifications:
  • Forum topics:
  • Wiki pages:
  • Tracker tickets:
  • MCreator plugins:
  • Comments:
That does not work
Mon, 01/11/2021 - 03:38

That does not work