Error compile Entity

Started by Mephistophel__ on Tue, 01/19/2021 - 18:57

Topic category: Bugs and solutions

Last seen on 11:39, 27. Feb 2021
Joined Dec 2020
User points:

User statistics:

  • Modifications:
  • Forum topics:
  • Wiki pages:
  • Tracker tickets:
  • MCreator plugins:
  • Comments:
Error compile Entity
Tue, 01/19/2021 - 18:57

I'm new to modding, can you tell me what the problem is?
Mcreator 2020.5
console:

Executing Gradle task: build
Build info: MCreator 2020.5.47520, forge-1.12.2, 64-bit, 3912 MB, Windows 7, JVM 1.8.0_265, JAVA_HOME: C:\Users\Admin\AppData\Roaming\.minecraft\MCreator\jdk
This mapping 'snapshot_20171003' was designed for MC 1.12! Use at your own peril.
:deobfCompileDummyTask
:deobfProvidedDummyTask
:sourceApiJava UP-TO-DATE
:compileApiJava NO-SOURCE
:processApiResources NO-SOURCE
:apiClasses UP-TO-DATE
:sourceMainJava
C:\Users\Admin\MCreatorWorkspaces\domodforyourself\build\sources\main\java\net\mcreator\domodforyourself\entity\EntityElderFavn.java:230: error: expected private final ModelRenderer RightLeg;private final ModelRenderer 12;private final ModelRenderer 21;private final ModelRenderer 31;
^
C:\Users\Admin\MCreatorWorkspaces\domodforyourself\build\sources\main\java\net\mcreator\domodforyourself\entity\EntityElderFavn.java:230: error: expected private final ModelRenderer RightLeg;private final ModelRenderer 12;private final ModelRenderer 21;private final ModelRenderer 31;
^
C:\Users\Admin\MCreatorWorkspaces\domodforyourself\build\sources\main\java\net\mcreator\domodforyourself\entity\EntityElderFavn.java:230: error: expected private final ModelRenderer RightLeg;private final ModelRenderer 12;private final ModelRenderer 21;private final ModelRenderer 31;
^
C:\Users\Admin\MCreatorWorkspaces\domodforyourself\build\sources\main\java\net\mcreator\domodforyourself\entity\EntityElderFavn.java:233: error: expected private final ModelRenderer LeftLeg;private final ModelRenderer 2;private final ModelRenderer 3;private final ModelRenderer 4;
^
C:\Users\Admin\MCreatorWorkspaces\domodforyourself\build\sources\main\java\net\mcreator\domodforyourself\entity\EntityElderFavn.java:233: error: expected private final ModelRenderer LeftLeg;private final ModelRenderer 2;private final ModelRenderer 3;private final ModelRenderer 4;
^
C:\Users\Admin\MCreatorWorkspaces\domodforyourself\build\sources\main\java\net\mcreator\domodforyourself\entity\EntityElderFavn.java:233: error: expected private final ModelRenderer LeftLeg;private final ModelRenderer 2;private final ModelRenderer 3;private final ModelRenderer 4;
^
C:\Users\Admin\MCreatorWorkspaces\domodforyourself\build\sources\main\java\net\mcreator\domodforyourself\entity\EntityElderFavn.java:421: error: not a statement 12.setRotationPoint(7.0F, 18.0F, 5.0F);
^
C:\Users\Admin\MCreatorWorkspaces\domodforyourself\build\sources\main\java\net\mcreator\domodforyourself\entity\EntityElderFavn.java:421: error: ';' expected 12.setRotationPoint(7.0F, 18.0F, 5.0F);
^
C:\Users\Admin\MCreatorWorkspaces\domodforyourself\build\sources\main\java\net\mcreator\domodforyourself\entity\EntityElderFavn.java:424: error: not a statement 12.cubeList.add(new ModelBox(12, 12, 55, -5.5189F, -19.8294F, 4.0917F, 3, 10, 3, 0.0F, false));
^
C:\Users\Admin\MCreatorWorkspaces\domodforyourself\build\sources\main\java\net\mcreator\domodforyourself\entity\EntityElderFavn.java:424: error: ';' expected 12.cubeList.add(new ModelBox(12, 12, 55, -5.5189F, -19.8294F, 4.0917F, 3, 10, 3, 0.0F, false));
^
C:\Users\Admin\MCreatorWorkspaces\domodforyourself\build\sources\main\java\net\mcreator\domodforyourself\entity\EntityElderFavn.java:425: error: not a statement 12.cubeList.add(new ModelBox(12, 52, 42, -6.0189F, -18.8294F, 3.5917F, 4, 6, 4, 0.0F, false));
^
C:\Users\Admin\MCreatorWorkspaces\domodforyourself\build\sources\main\java\net\mcreator\domodforyourself\entity\EntityElderFavn.java:425: error: ';' expected 12.cubeList.add(new ModelBox(12, 52, 42, -6.0189F, -18.8294F, 3.5917F, 4, 6, 4, 0.0F, false));
^
C:\Users\Admin\MCreatorWorkspaces\domodforyourself\build\sources\main\java\net\mcreator\domodforyourself\entity\EntityElderFavn.java:427: error: not a statement 21.setRotationPoint(0.0F, 16.0F, 9.0F);
^
C:\Users\Admin\MCreatorWorkspaces\domodforyourself\build\sources\main\java\net\mcreator\domodforyourself\entity\EntityElderFavn.java:427: error: ';' expected 21.setRotationPoint(0.0F, 16.0F, 9.0F);
^
C:\Users\Admin\MCreatorWorkspaces\domodforyourself\build\sources\main\java\net\mcreator\domodforyourself\entity\EntityElderFavn.java:430: error: not a statement 21.cubeList.add(new ModelBox(21, 18, 29, 0.6F, -10.5F, -9.0F, 2, 2, 7, 0.0F, false));
^
C:\Users\Admin\MCreatorWorkspaces\domodforyourself\build\sources\main\java\net\mcreator\domodforyourself\entity\EntityElderFavn.java:430: error: ';' expected 21.cubeList.add(new ModelBox(21, 18, 29, 0.6F, -10.5F, -9.0F, 2, 2, 7, 0.0F, false));
^
C:\Users\Admin\MCreatorWorkspaces\domodforyourself\build\sources\main\java\net\mcreator\domodforyourself\entity\EntityElderFavn.java:431: error: not a statement 21.cubeList.add(new ModelBox(21, 14, 83, 0.2F, -11.0F, -5.0F, 3, 3, 4, 0.0F, false));
^
C:\Users\Admin\MCreatorWorkspaces\domodforyourself\build\sources\main\java\net\mcreator\domodforyourself\entity\EntityElderFavn.java:431: error: ';' expected 21.cubeList.add(new ModelBox(21, 14, 83, 0.2F, -11.0F, -5.0F, 3, 3, 4, 0.0F, false));
^
C:\Users\Admin\MCreatorWorkspaces\domodforyourself\build\sources\main\java\net\mcreator\domodforyourself\entity\EntityElderFavn.java:433: error: not a statement 31.setRotationPoint(-2.0F, 21.0F, -3.0F);
^
C:\Users\Admin\MCreatorWorkspaces\domodforyourself\build\sources\main\java\net\mcreator\domodforyourself\entity\EntityElderFavn.java:433: error: ';' expected 31.setRotationPoint(-2.0F, 21.0F, -3.0F);
^
C:\Users\Admin\MCreatorWorkspaces\domodforyourself\build\sources\main\java\net\mcreator\domodforyourself\entity\EntityElderFavn.java:436: error: not a statement 31.cubeList.add(new ModelBox(31, 24, 103, 2.9F, -16.0134F, 6.0304F, 2, 2, 1, 0.0F, false));
^
C:\Users\Admin\MCreatorWorkspaces\domodforyourself\build\sources\main\java\net\mcreator\domodforyourself\entity\EntityElderFavn.java:436: error: ';' expected 31.cubeList.add(new ModelBox(31, 24, 103, 2.9F, -16.0134F, 6.0304F, 2, 2, 1, 0.0F, false));
^
C:\Users\Admin\MCreatorWorkspaces\domodforyourself\build\sources\main\java\net\mcreator\domodforyourself\entity\EntityElderFavn.java:453: error: not a statement 2.setRotationPoint(3.0F, 19.0F, 8.0F);
^
C:\Users\Admin\MCreatorWorkspaces\domodforyourself\build\sources\main\java\net\mcreator\domodforyourself\entity\EntityElderFavn.java:453: error: ';' expected 2.setRotationPoint(3.0F, 19.0F, 8.0F);
^
C:\Users\Admin\MCreatorWorkspaces\domodforyourself\build\sources\main\java\net\mcreator\domodforyourself\entity\EntityElderFavn.java:456: error: not a statement 2.cubeList.add(new ModelBox(2, 24, 55, -7.5F, -20.0F, 3.9F, 3, 10, 3, 0.0F, false));
^
C:\Users\Admin\MCreatorWorkspaces\domodforyourself\build\sources\main\java\net\mcreator\domodforyourself\entity\EntityElderFavn.java:456: error: ';' expected 2.cubeList.add(new ModelBox(2, 24, 55, -7.5F, -20.0F, 3.9F, 3, 10, 3, 0.0F, false));
^
C:\Users\Admin\MCreatorWorkspaces\domodforyourself\build\sources\main\java\net\mcreator\domodforyourself\entity\EntityElderFavn.java:457: error: not a statement 2.cubeList.add(new ModelBox(2, 36, 42, -8.0F, -19.0F, 3.4F, 4, 6, 4, 0.0F, false));
^
C:\Users\Admin\MCreatorWorkspaces\domodforyourself\build\sources\main\java\net\mcreator\domodforyourself\entity\EntityElderFavn.java:457: error: ';' expected 2.cubeList.add(new ModelBox(2, 36, 42, -8.0F, -19.0F, 3.4F, 4, 6, 4, 0.0F, false));
^
C:\Users\Admin\MCreatorWorkspaces\domodforyourself\build\sources\main\java\net\mcreator\domodforyourself\entity\EntityElderFavn.java:459: error: not a statement 3.setRotationPoint(-3.0F, 16.0F, 10.0F);
^
C:\Users\Admin\MCreatorWorkspaces\domodforyourself\build\sources\main\java\net\mcreator\domodforyourself\entity\EntityElderFavn.java:459: error: ';' expected 3.setRotationPoint(-3.0F, 16.0F, 10.0F);
^
C:\Users\Admin\MCreatorWorkspaces\domodforyourself\build\sources\main\java\net\mcreator\domodforyourself\entity\EntityElderFavn.java:462: error: not a statement 3.cubeList.add(new ModelBox(3, 0, 42, 0.5F, -10.5F, -9.0F, 2, 2, 7, 0.0F, false));
^
C:\Users\Admin\MCreatorWorkspaces\domodforyourself\build\sources\main\java\net\mcreator\domodforyourself\entity\EntityElderFavn.java:462: error: ';' expected 3.cubeList.add(new ModelBox(3, 0, 42, 0.5F, -10.5F, -9.0F, 2, 2, 7, 0.0F, false));
^
C:\Users\Admin\MCreatorWorkspaces\domodforyourself\build\sources\main\java\net\mcreator\domodforyourself\entity\EntityElderFavn.java:463: error: not a statement 3.cubeList.add(new ModelBox(3, 0, 83, 0.0F, -11.0F, -5.0F, 3, 3, 4, 0.0F, false));
^
C:\Users\Admin\MCreatorWorkspaces\domodforyourself\build\sources\main\java\net\mcreator\domodforyourself\entity\EntityElderFavn.java:463: error: ';' expected 3.cubeList.add(new ModelBox(3, 0, 83, 0.0F, -11.0F, -5.0F, 3, 3, 4, 0.0F, false));
^
C:\Users\Admin\MCreatorWorkspaces\domodforyourself\build\sources\main\java\net\mcreator\domodforyourself\entity\EntityElderFavn.java:465: error: not a statement 4.setRotationPoint(-5.0F, 21.0F, -2.0F);
^
C:\Users\Admin\MCreatorWorkspaces\domodforyourself\build\sources\main\java\net\mcreator\domodforyourself\entity\EntityElderFavn.java:465: error: ';' expected 4.setRotationPoint(-5.0F, 21.0F, -2.0F);
^
C:\Users\Admin\MCreatorWorkspaces\domodforyourself\build\sources\main\java\net\mcreator\domodforyourself\entity\EntityElderFavn.java:468: error: not a statement 4.cubeList.add(new ModelBox(4, 30, 103, 2.2F, -16.0134F, 6.0304F, 2, 2, 1, 0.0F, false));
^
C:\Users\Admin\MCreatorWorkspaces\domodforyourself\build\sources\main\java\net\mcreator\domodforyourself\entity\EntityElderFavn.java:468: error: ';' expected 4.cubeList.add(new ModelBox(4, 30, 103, 2.2F, -16.0134F, 6.0304F, 2, 2, 1, 0.0F, false));
^
38 errors
:compileJava FAILED
FAILURE: Build failed with an exception.
* What went wrong:
Execution failed for task ':compileJava'.
> Compilation failed; see the compiler error output for details.
* Try:
Run with --stacktrace option to get the stack trace. Run with --info or --debug option to get more log output. Run with --scan to get full insights.
* Get more help at https://help.gradle.org
BUILD FAILED in 5s
5 actionable tasks: 4 executed, 1 up-to-date
BUILD FAILED
Task completed in 18029 milliseconds

Last seen on 20:52, 27. Feb 2021
Joined Apr 2010
User points:

User statistics:

  • Modifications:
  • Forum topics:
  • Wiki pages:
  • Tracker tickets:
  • MCreator plugins:
  • Comments:
You either gave invalid…
Wed, 01/20/2021 - 09:41

You either gave invalid names to model parts or used a modeler software that produces a buggy model code.