i need help to change entity scale( make it little)

Started by Pokedaniel2605 on Thu, 04/15/2021 - 20:22

Topic category: Help with modding (Java Edition)

Last seen on 10:20, 7. May 2021
Joined Mar 2021
Points:

User statistics:

  • Modifications:
  • Forum topics:
  • Wiki pages:
  • Tracker tickets:
  • MCreator plugins:
  • Comments:
i need help to change entity scale( make it little)
Thu, 04/15/2021 - 20:22

Greetings, I wanted to know if it is possible to change the scale of an entity, make the entity little , thanks

Last seen on 10:20, 7. May 2021
Joined Mar 2021
Points:

User statistics:

  • Modifications:
  • Forum topics:
  • Wiki pages:
  • Tracker tickets:
  • MCreator plugins:
  • Comments:
Executing      Gradle task:…
Fri, 04/16/2021 - 12:47

Executing 
    Gradle task: build

Build 
    info: MCreator 2020.5.47520, forge-1.15.2, 64-bit, 7116 MB, Windows 10, 
    JVM 1.8.0_265, JAVA_HOME: C:\Program Files\Pylo\MCreator\jdk


    Configure project :

New 
    Dep: net.minecraftforge:forge:1.15.2-31.2.0_mapped_snapshot_20200514-1.15.1


    Task :compileJava FAILED

C:\Users\julio\MCreatorWorkspaces\rei_chikita_mod\src\main\java\net\mcreator\reichikitamod\entity\ReichikitaEntity.java:251: 
    error: ';' expected 
GL11.glScalef(f4, 
    f4, f4) in

 
                            ^


    error

FAILURE: 
    Build failed with an exception.


    What went wrong:

Execution 
    failed for task ':compileJava'.


    Compilation failed; see the compiler error output for details.


    Try:

Run 
    with --stacktrace option to get the stack trace. Run with --info or 
    --debug option to get more log output. Run with --scan to get full 
    insights.


    Get more help at https://help.gradle.org

Deprecated 
    Gradle features were used in this build, making it incompatible with 
    Gradle 5.0.

Use 
    '--warning-mode all' to show the individual deprecation warnings.

See 
    https://docs.gradle.org/4.10.3/userguide/command_line_interface.html#se…

BUILD 
    FAILED in 3s


    actionable task: 1 executed

BUILD 
    FAILED

Task 
    completed in 5169 milliseconds