Mob error Pls Help me

Started by EYÜP EYMEN on Wed, 07/07/2021 - 16:39

Topic category: General discussion

Last seen on 09:38, 19. Sep 2021
Joined Jul 2021
Points:

User statistics:

  • Modifications:
  • Forum topics:
  • Wiki pages:
  • Tracker tickets:
  • MCreator plugins:
  • Comments:
Mob error Pls Help me
Wed, 07/07/2021 - 16:39

 

Hello, I made a mod in minecraft, I designed a creature, it gave an error because there are things that don't work properly in your project, how can I solve it?

Please help me

Last seen on 09:38, 19. Sep 2021
Joined Jul 2021
Points:

User statistics:

  • Modifications:
  • Forum topics:
  • Wiki pages:
  • Tracker tickets:
  • MCreator plugins:
  • Comments:
please help me
Sat, 07/10/2021 - 12:45

please help me

It's really hard to see…
Sun, 07/11/2021 - 08:55

It's really hard to see anything on this screenshot. There is a copy button in the console left toolbar that you can use to copy the entire console output. You can then upload that to a website like pastebin and link it here.

Last seen on 09:38, 19. Sep 2021
Joined Jul 2021
Points:

User statistics:

  • Modifications:
  • Forum topics:
  • Wiki pages:
  • Tracker tickets:
  • MCreator plugins:
  • Comments:
Executing      Gradle task:…
Sat, 07/31/2021 - 10:05

Executing 
    Gradle task: build

Build 
    info: MCreator 2021.1.18117, forge-1.16.5, 64-bit, 8070 MB, Windows 10, 
    JVM 1.8.0_275, JAVA_HOME: C:\Program Files\Pylo\MCreator\jdk


    Task :compileJava

C:\Users\user\MCreatorWorkspaces\ruby_mode\src\main\java\net\mcreator\rubymode\entity\renderer\RubygolemRenderer.java:41: 
    error: Modelcustom_model is not abstract and does not override abstract 
    method render(MatrixStack,IVertexBuilder,int,int,float,float,float,float) 
    in Model 
 
      public static class Modelcustom_model extends EntityModel<Entity> {

 
                    ^

C:\Users\user\MCreatorWorkspaces\ruby_mode\src\main\java\net\mcreator\rubymode\entity\renderer\RubygolemRenderer.java:49: 
    error: cannot find symbol 
 
            texWidth = 64;

 
            ^

 
     symbol:   variable texWidth

 
     location: class Modelcustom_model

C:\Users\user\MCreatorWorkspaces\ruby_mode\src\main\java\net\mcreator\rubymode\entity\renderer\RubygolemRenderer.java:50: 
    error: cannot find symbol 
 
            texHeight = 64;

 
            ^

 
     symbol:   variable texHeight

 
     location: class Modelcustom_model

C:\Users\user\MCreatorWorkspaces\ruby_mode\src\main\java\net\mcreator\rubymode\entity\renderer\RubygolemRenderer.java:52: 
    error: cannot find symbol 
 
            sagbacak.setPos(0.0F, 24.0F, 0.0F);

 
                    ^

 
     symbol:   method setPos(float,float,float)

 
     location: variable sagbacak of type ModelRenderer

C:\Users\user\MCreatorWorkspaces\ruby_mode\src\main\java\net\mcreator\rubymode\entity\renderer\RubygolemRenderer.java:53: 
    error: cannot find symbol 
 
            sagbacak.texOffs(0, 0).addBox(0.0F, -1.0F, -5.0F, -4.0F, 1.0F, 
    1.0F, 0.0F, false);

 
                    ^

 
     symbol:   method texOffs(int,int)

 
     location: variable sagbacak of type ModelRenderer

C:\Users\user\MCreatorWorkspaces\ruby_mode\src\main\java\net\mcreator\rubymode\entity\renderer\RubygolemRenderer.java:54: 
    error: cannot find symbol 
 
            sagbacak.texOffs(18, 15).addBox(-4.0F, -6.0F, -4.0F, 4.0F, 6.0F, 
    5.0F, 0.0F, false);

 
                    ^

 
     symbol:   method texOffs(int,int)

 
     location: variable sagbacak of type ModelRenderer

C:\Users\user\MCreatorWorkspaces\ruby_mode\src\main\java\net\mcreator\rubymode\entity\renderer\RubygolemRenderer.java:56: 
    error: cannot find symbol 
 
            solbacak2.setPos(0.0F, 24.0F, 0.0F);

 
                     ^

 
     symbol:   method setPos(float,float,float)

 
     location: variable solbacak2 of type ModelRenderer

C:\Users\user\MCreatorWorkspaces\ruby_mode\src\main\java\net\mcreator\rubymode\entity\renderer\RubygolemRenderer.java:57: 
    error: cannot find symbol 
 
            solbacak2.texOffs(0, 0).addBox(4.0F, -1.0F, -5.0F, -4.0F, 1.0F, 
    1.0F, 0.0F, false);

 
                     ^

 
     symbol:   method texOffs(int,int)

 
     location: variable solbacak2 of type ModelRenderer

C:\Users\user\MCreatorWorkspaces\ruby_mode\src\main\java\net\mcreator\rubymode\entity\renderer\RubygolemRenderer.java:58: 
    error: cannot find symbol 
 
            solbacak2.texOffs(0, 15).addBox(0.0F, -6.0F, -4.0F, 4.0F, 6.0F, 
    5.0F, 0.0F, false);

 
                     ^

 
     symbol:   method texOffs(int,int)

 
     location: variable solbacak2 of type ModelRenderer

C:\Users\user\MCreatorWorkspaces\ruby_mode\src\main\java\net\mcreator\rubymode\entity\renderer\RubygolemRenderer.java:60: 
    error: cannot find symbol 
 
            sagkol.setPos(9.0F, 13.0F, 1.0F);

 
                  ^

 
     symbol:   method setPos(float,float,float)

 
     location: variable sagkol of type ModelRenderer

C:\Users\user\MCreatorWorkspaces\ruby_mode\src\main\java\net\mcreator\rubymode\entity\renderer\RubygolemRenderer.java:61: 
    error: cannot find symbol 
 
            sagkol.texOffs(0, 0).addBox(-14.0F, -1.0F, -5.0F, -3.0F, 8.0F, 
    3.0F, 0.0F, false);

 
                  ^

 
     symbol:   method texOffs(int,int)

 
     location: variable sagkol of type ModelRenderer

C:\Users\user\MCreatorWorkspaces\ruby_mode\src\main\java\net\mcreator\rubymode\entity\renderer\RubygolemRenderer.java:63: 
    error: cannot find symbol 
 
            solkol.setPos(9.0F, 13.0F, 1.0F);

 
                  ^

 
     symbol:   method setPos(float,float,float)

 
     location: variable solkol of type ModelRenderer

C:\Users\user\MCreatorWorkspaces\ruby_mode\src\main\java\net\mcreator\rubymode\entity\renderer\RubygolemRenderer.java:64: 
    error: cannot find symbol 
 
            solkol.texOffs(0, 0).addBox(-1.0F, -1.0F, -5.0F, -3.0F, 8.0F, 
    3.0F, 0.0F, false);

 
                  ^

 
     symbol:   method texOffs(int,int)

 
     location: variable solkol of type ModelRenderer

C:\Users\user\MCreatorWorkspaces\ruby_mode\src\main\java\net\mcreator\rubymode\entity\renderer\RubygolemRenderer.java:66: 
    error: cannot find symbol 
 
            kafa.setPos(0.0F, 24.0F, 0.0F);

 
                ^

 
     symbol:   method setPos(float,float,float)

 
     location: variable kafa of type ModelRenderer

C:\Users\user\MCreatorWorkspaces\ruby_mode\src\main\java\net\mcreator\rubymode\entity\renderer\RubygolemRenderer.java:67: 
    error: cannot find symbol 
 
            kafa.texOffs(0, 26).addBox(-3.0F, -18.0F, -3.0F, 6.0F, 4.0F, 4.0F, 
    0.0F, false);

 
                ^

 
     symbol:   method texOffs(int,int)

 
     location: variable kafa of type ModelRenderer

C:\Users\user\MCreatorWorkspaces\ruby_mode\src\main\java\net\mcreator\rubymode\entity\renderer\RubygolemRenderer.java:69: 
    error: cannot find symbol 
 
            bb_main.setPos(0.0F, 24.0F, 0.0F);

 
                   ^

 
     symbol:   method setPos(float,float,float)

 
     location: variable bb_main of type ModelRenderer

C:\Users\user\MCreatorWorkspaces\ruby_mode\src\main\java\net\mcreator\rubymode\entity\renderer\RubygolemRenderer.java:70: 
    error: cannot find symbol 
 
            bb_main.texOffs(0, 0).addBox(-5.0F, -14.0F, -5.0F, 10.0F, 8.0F, 
    7.0F, 0.0F, false);

 
                   ^

 
     symbol:   method texOffs(int,int)

 
     location: variable bb_main of type ModelRenderer

C:\Users\user\MCreatorWorkspaces\ruby_mode\src\main\java\net\mcreator\rubymode\entity\renderer\RubygolemRenderer.java:73: 
    error: method does not override or implement a method from a supertype 
 
         @Override

 
         ^

C:\Users\user\MCreatorWorkspaces\ruby_mode\src\main\java\net\mcreator\rubymode\entity\renderer\RubygolemRenderer.java:78: 
    error: method does not override or implement a method from a supertype 
 
         @Override

 
         ^

C:\Users\user\MCreatorWorkspaces\ruby_mode\src\main\java\net\mcreator\rubymode\entity\renderer\RubygolemRenderer.java:90: 
    error: cannot find symbol 
 
            modelRenderer.xRot = x;

 
                         ^

 
     symbol:   variable xRot

 
     location: variable modelRenderer of type ModelRenderer

C:\Users\user\MCreatorWorkspaces\ruby_mode\src\main\java\net\mcreator\rubymode\entity\renderer\RubygolemRenderer.java:91: 
    error: cannot find symbol 
 
            modelRenderer.yRot = y;

 
                         ^

 
     symbol:   variable yRot

 
     location: variable modelRenderer of type ModelRenderer

C:\Users\user\MCreatorWorkspaces\ruby_mode\src\main\java\net\mcreator\rubymode\entity\renderer\RubygolemRenderer.java:92: 
    error: cannot find symbol 
 
            modelRenderer.zRot = z;

 
                         ^

 
     symbol:   variable zRot

 
     location: variable modelRenderer of type ModelRenderer

22 
    errors


    Task :compileJava FAILED

FAILURE: 
    Build failed with an exception.


    What went wrong:

Execution 
    failed for task ':compileJava'.


    Compilation failed; see the compiler error output for details.


    Try:

Run 
    with --stacktrace option to get the stack trace. Run with --info or 
    --debug option to get more log output. Run with --scan to get full 
    insights.


    Get more help at https://help.gradle.org

BUILD 
    FAILED in 53s


    actionable task: 1 executed

BUILD 
    FAILED

Task 
    completed in 58 seconds

 

ok? 

pastebin did not open

Last seen on 09:38, 19. Sep 2021
Joined Jul 2021
Points:

User statistics:

  • Modifications:
  • Forum topics:
  • Wiki pages:
  • Tracker tickets:
  • MCreator plugins:
  • Comments:
@Matej please help me
Sun, 09/12/2021 - 12:52

@Matej please help me