mcreator grandle cahes got corrupted

Started by megafunforever on Sat, 01/01/2022 - 02:21

Topic category: Troubleshooting, bugs, and solutions

Last seen on 18:36, 22. Jan 2022
Joined Jan 2022
Points:

User statistics:

  • Modifications:
  • Forum topics:
  • Wiki pages:
  • Tracker tickets:
  • MCreator plugins:
  • Comments:
mcreator grandle cahes got corrupted
Thu, 01/06/2022 - 03:13 (edited)

whenever I create a project it says that the gradle caches got corrupted and that I have to clear or the gradle caches or the entire gradle folder, and when I click on any of them, it goes back to the familiar workspace setup failed error and doesn't do what the buttons says.

 

 

 

 

how do I fix it?

Edited by megafunforever on Thu, 01/06/2022 - 03:13
Last seen on 18:36, 22. Jan 2022
Joined Jan 2022
Points:

User statistics:

  • Modifications:
  • Forum topics:
  • Wiki pages:
  • Tracker tickets:
  • MCreator plugins:
  • Comments:
how do I do that?
Thu, 01/06/2022 - 03:13

how do I do that?

Last seen on 21:51, 26. Jan 2022
Joined Sep 2020
Points:

User statistics:

  • Modifications:
  • Forum topics:
  • Wiki pages:
  • Tracker tickets:
  • MCreator plugins:
  • Comments:
Stop your antivirus for the…
Mon, 01/10/2022 - 20:14

Stop your antivirus for the time that mcreator compile the workspace or add the mcreator process to the whitelist if it have one

Last seen on 16:54, 23. Jan 2022
Joined Mar 2020
Points:

User statistics:

  • Modifications:
  • Forum topics:
  • Wiki pages:
  • Tracker tickets:
  • MCreator plugins:
  • Comments:
Same thing is happening to…
Fri, 01/14/2022 - 01:05

Same thing is happening to me, and my antivirus is dosen't uninstall in files. I updated to the First Release of 2021.3, and when i launched the workspace, it had compile problems due to Keybind, and it happened to all my workspaces, i installed the new version of 2021.3 cause it says that there is many bug fix. and now, im having the same problem as megafunforever

Last seen on 21:51, 26. Jan 2022
Joined Sep 2020
Points:

User statistics:

  • Modifications:
  • Forum topics:
  • Wiki pages:
  • Tracker tickets:
  • MCreator plugins:
  • Comments:
You don't need to disinstall…
Sat, 01/15/2022 - 10:24

You don't need to disinstall the antivirus, only stop it and restart mcreator

Last seen on 06:35, 21. Jan 2022
Joined Jan 2022
Points:

User statistics:

  • Modifications:
  • Forum topics:
  • Wiki pages:
  • Tracker tickets:
  • MCreator plugins:
  • Comments:
plz tell me what to do i…
Thu, 01/20/2022 - 11:45

plz tell me what to do i have the same problem and i disabled my antivirus.... no luck :(
 

Last seen on 16:54, 23. Jan 2022
Joined Mar 2020
Points:

User statistics:

  • Modifications:
  • Forum topics:
  • Wiki pages:
  • Tracker tickets:
  • MCreator plugins:
  • Comments:
I can't access any of my…
Sun, 01/23/2022 - 16:22

I can't access any of my workspaces since the day i updated to 2021.3, plus, one of them ain't even mine... idk what to do.

Last seen on 16:54, 23. Jan 2022
Joined Mar 2020
Points:

User statistics:

  • Modifications:
  • Forum topics:
  • Wiki pages:
  • Tracker tickets:
  • MCreator plugins:
  • Comments:
IF tHiS cAn HeLp: FAILURE:…
Sun, 01/23/2022 - 16:34

IF tHiS cAn HeLp:

FAILURE: Build failed with an exception.
* What went wrong:
Could not resolve all files for configuration ':runtimeClasspathCopy'.
> Could not find net.minecraftforge:forge:1.16.5-36.2.20_mapped_snapshot_20201028-1.16.3.
 Searched in the following locations:
 - file:/C:/Users/taher_7e6gscw/.mcreator/gradle/caches/forge_gradle/bundeled_repo/net/minecraftforge/forge/1.16.5-36.2.20_mapped_snapshot_20201028-1.16.3/forge-1.16.5-36.2.20_mapped_snapshot_20201028-1.16.3.pom
 - file:/C:/Users/taher_7e6gscw/.mcreator/gradle/caches/forge_gradle/bundeled_repo/net/minecraftforge/forge/1.16.5-36.2.20_mapped_snapshot_20201028-1.16.3/forge-1.16.5-36.2.20_mapped_snapshot_20201028-1.16.3.jar
 Required by:
  project :
* Try:
Run with --stacktrace option to get the stack trace. Run with --info or --debug option to get more log output. Run with --scan to get full insights.
* Get more help at https://help.gradle.org
BUILD FAILED in 1m 44s
Task completed in 1 minute and 57 seconds