Topic category: Troubleshooting, bugs, and solutions
when i add any biome this happens
Executing Gradle task: runClient
Build info: MCreator 2025.2.28610, forge-1.16.5, 64-bit, 32123 MB, Windows 10, JVM 21.0.7, JAVA_HOME: G:\Mcreator\jdk, started on: 2026-07-19-23:23:22
> Task :compileJava FAILED
C:\Users\yes the scientist\MCreatorWorkspaces\yahiamice\src\main\java\net\mcreator\yahiamice\init\YahiamiceModBiomes.java:20: error: cannot find symbol public static final RegistryObject<Biome> TEST = REGISTRY.register("test", TestBiome::createBiome);
^
symbol: variable TestBiome
location: class net.mcreator.yahiamice.init.YahiamiceModBiomes
C:\Users\yes the scientist\MCreatorWorkspaces\yahiamice\src\main\java\net\mcreator\yahiamice\init\YahiamiceModBiomes.java:24: error: cannot find symbol TestBiome.init();
^
symbol: variable TestBiome
location: class net.mcreator.yahiamice.init.YahiamiceModBiomes
2 errors
FAILURE: Build failed with an exception.
* What went wrong:
Execution failed for task ':compileJava'.
> Compilation failed; see the compiler output below.
C:\Users\yes the scientist\MCreatorWorkspaces\yahiamice\src\main\java\net\mcreator\yahiamice\init\YahiamiceModBiomes.java:20: error: cannot find symbol public static final RegistryObject<Biome> TEST = REGISTRY.register("test", TestBiome::createBiome);
^
symbol: variable TestBiome
location: class net.mcreator.yahiamice.init.YahiamiceModBiomes
2 errors
* Try:
> Check your code and dependencies to fix the compilation error(s)
> Run with --scan to get full insights.
BUILD FAILED in 1s
1 actionable task: 1 executed
BUILD FAILED
Task completed in 2 seconds
MCreator 2026.2 and Forge 1.16.2 are both no longer supported. Please update to MCreator 2026.2 with one of the provided NeoForge generator.