ran into a problem

Started by zxczxczxczxczx… on

Topic category: Help with MCreator software

Last seen on 20:50, 13. Dec 2023
Joined Dec 2023
Points:

User statistics:

  • Modifications:
  • Forum topics:
  • Wiki pages:
  • MCreator plugins:
  • Comments:
ran into a problem


when I loaded the 3D model I wanted to use for the armor, it didn't work. it just gives me this error and I don’t know what to do, help

Last seen on 20:50, 13. Dec 2023
Joined Dec 2023
Points:

User statistics:

  • Modifications:
  • Forum topics:
  • Wiki pages:
  • MCreator plugins:
  • Comments:
^100 errorsFAILURE: Build…
Sat, 12/02/2023 - 21:26

^
100 errors
FAILURE: Build failed with an exception.
* What went wrong:
Execution failed for task ':compileJava'.
> Compilation failed; see the compiler error output for details.
* Try:
Run with --stacktrace option to get the stack trace. Run with --info or --debug option to get more log output. Run with --scan to get full insights.
* Get more help at https://help.gradle.org
BUILD FAILED in 1s
1 actionable task: 1 executed

Last seen on 19:02, 2. Mar 2024
Joined Oct 2023
Points:

User statistics:

  • Modifications:
  • Forum topics:
  • Wiki pages:
  • MCreator plugins:
  • Comments:
It's a compile error, make…
Tue, 01/09/2024 - 03:31

It's a compile error, make sure your model is compatible and isn't too large for the game, and also test if removing it fixes the bug to confirm that the model is causing it.