Model not working even though I've had no issues before

Started by Mido-shonun on

Topic category: Plugins and third-party tools

Last seen on 17:02, 18. Jun 2024
Joined Aug 2022
Points:

User statistics:

  • Modifications:
  • Forum topics:
  • Wiki pages:
  • MCreator plugins:
  • Comments:
Model not working even though I've had no issues before

Executing Gradle task: runClient
Build info: MCreator 2023.4.52316, forge-1.20.1, 64-bit, 16314 MB, Windows 10, JVM 17.0.9, JAVA_HOME: C:\Program Files\Pylo\MCreator\jdk, started on: 2024-05-13-12:42:34
Loaded APIs: kleidersplayerrenderer, pehkui, structure_expansion, rei, playeranimator, particlepresets, cloth-config
> Configure project :
MixinGradle did not locate the diffplug APT plugin, skipping eclipse task configuration
> Task :downloadMcpConfig
> Task :extractSrg UP-TO-DATE
> Task :createMcpToSrg UP-TO-DATE
> Task :compileJava FAILED
C:\Users\notmi\MCreatorWorkspaces\tokyo_ghoul\src\main\java\net\mcreator\tokyoghoul\client\model\ModelArataProto.java:20: error: illegal start of type public class ModelArataProto<T extends> extends EntityModel<> {
^
C:\Users\notmi\MCreatorWorkspaces\tokyo_ghoul\src\main\java\net\mcreator\tokyoghoul\client\model\ModelArataProto.java:20: error: illegal start of type public class ModelArataProto<T extends> extends EntityModel<> {
^
C:\Users\notmi\MCreatorWorkspaces\tokyo_ghoul\src\main\java\net\mcreator\tokyoghoul\client\model\ModelArataProto.java:88: error:expected public void setupAnim( entity, float limbSwing, float limbSwingAmount, float ageInTicks, float netHeadYaw, float headPitch) {
^
3 errors
FAILURE: Build failed with an exception.
* What went wrong:
Execution failed for task ':compileJava'.
> Compilation failed; see the compiler error output for details.
* Try:
> Run with --stacktrace option to get the stack trace.
> Run with --info or --debug option to get more log output.
> Run with --scan to get full insights.
* Get more help at https://help.gradle.org
BUILD FAILED in 4s
4 actionable tasks: 2 executed, 2 up-to-date
BUILD FAILED
Task completed in 4 seconds


idk whats going on, and no, im not going to remove any of the apis.