mcreator 2024.4 gives me error

Started by Pintus_Vision on

Topic category: Help with MCreator software

Joined Apr 2024
Points:

User statistics:

  • Modifications:
  • Forum topics:
  • Wiki pages:
  • MCreator plugins:
  • Comments:
mcreator 2024.4 gives me error

I open my workspace after updating MCreator to 2024.4 and it gives me an error... 

Executing Gradle synchronization tasks
Build info: MCreator 2024.4.52410, forge-1.20.1, 64-bit, 7964 MB, Windows 11, JVM 21.0.4, JAVA_HOME: C:\Program Files\Pylo\MCreator\jdk, started on: 2025-02-26-13:56:24

FAILURE: Build failed with an exception.
* Where:
Build file 'C:\Users\federico\Desktop\PLM\build.gradle' line: 3
* What went wrong:
An exception occurred applying plugin request [id: 'org.spongepowered.mixin', version: '0.7.+']
> Failed to apply plugin 'org.spongepowered.mixin'.
> Could not find property 'minecraft', or 'patcher' on root project 'PLM', ensure ForgeGradle is applied.
* Try:
> Run with --stacktrace option to get the stack trace.
> Run with --info or --debug option to get more log output.
> Run with --scan to get full insights.
> Get more help at https://help.gradle.org.
CONFIGURE FAILED in 20s
org.gradle.tooling.BuildActionFailureException: The supplied phased action failed with an exception.
at org.gradle.tooling.internal.consumer.connection.PhasedActionAwareConsumerConnection.run(PhasedActionAwareConsumerConnection.java:58) at org.gradle.tooling.internal.consumer.connection.ParameterValidatingConsumerConnection.run(ParameterValidatingConsumerConnection.java:62) at org.gradle.tooling.internal.consumer.DefaultPhasedBuildActionExecuter$1.run(DefaultPhasedBuildActionExecuter.java:83) at....... (more, more, more)
Task completed in 21 seconds

How can I fix?