reobf fail problem

Started by Zarkx on Mon, 07/10/2017 - 15:16

Topic category: Help with MCreator's application

Last seen on 00:13, 14. Jan 2018
Joined Jun 2017
User points:

Statistics:

  • Comments:
  • Forum topics:
  • Modifications:
  • Wiki pages:
reobf fail problem
Mon, 07/10/2017 - 15:16

Hi, i've got a problem with reobf it fail me, here's the complete log

 

how can i fix this? (version 1.7.2 for 1.7.10 (i need the mod for 1.7.10))

 

   
Executing gradle command: build
Microsoft Windows [Versi¢n 6.3.9600]
(c) 2013 Microsoft Corporation. Todos los derechos reservados.
C:\Pylo\MCreator172>cd forge
C:\Pylo\MCreator172\forge>SET "JAVA_HOME=C:\Pylo\MCreator172\jdk64\"
C:\Pylo\MCreator172\forge>SET JAVA_EXE=%JAVA_HOME%\bin\java.exe
C:\Pylo\MCreator172\forge>SET PATH=%JAVA_HOME%\bin\;%PATH%
C:\Pylo\MCreator172\forge>gradlew -Dorg.gradle.jvmargs="-Xms625m -Xmx2048m" build
To honour the JVM settings for this build a new JVM will be forked. Please consider using the daemon: http://gradle.org/docs/2.0/userguide/gradle_daemon.html.
****************************
 Powered By MCP:             
 http://modcoderpack.com/    
 Searge, ProfMobius, Fesh0r, 
 R4wk, ZeuX, IngisKahn, bspkrs
 MCP Data version : unknown
****************************
:compileApiJava UP-TO-DATE
:processApiResources UP-TO-DATE
:apiClasses UP-TO-DATE
:sourceMainJava UP-TO-DATE
:compileJava
:processResources UP-TO-DATE
:classes
:jar UP-TO-DATE
:compileTestJava UP-TO-DATE
:processTestResources UP-TO-DATE
:testClasses UP-TO-DATE
:test UP-TO-DATE
:extractMcpData UP-TO-DATE
:getVersionJson
:extractUserDev UP-TO-DATE
:genSrgs SKIPPED
:reobf FAILED
FAILURE: Build failed with an exception.
* What went wrong:
Execution failed for task ':reobf'.
> MALFORMED
BUILD FAILED
* Try:
Run with --stacktrace option to get the stack trace. Run with --info or --debug option to get more log output.
Total time: 55.976 secs
C:\Pylo\MCreator172\forge>
Task completed with return code 0 in 57546 milliseconds

Last seen on 00:21, 11. Aug 2019
Joined Aug 2013
User points:

Statistics:

  • Comments:
  • Forum topics:
  • Modifications:
  • Wiki pages:
  • wiki contributor
  • moderator
Run the command "build" with
Mon, 07/10/2017 - 16:18

Run the command "build" with "--stacktrace", so you will get more information about what happened. (Go to Tools tab, click on run gradle task  and write down build --stacktrace)

Last seen on 00:13, 14. Jan 2018
Joined Jun 2017
User points:

Statistics:

  • Comments:
  • Forum topics:
  • Modifications:
  • Wiki pages:
Now i've got this...
Mon, 07/10/2017 - 18:22

Now i've got this...

 

   
Executing gradle command: build --stacktrace
Microsoft Windows [Versi¢n 6.3.9600]
(c) 2013 Microsoft Corporation. Todos los derechos reservados.
C:\Pylo\MCreator172>cd forge
C:\Pylo\MCreator172\forge>SET "JAVA_HOME=C:\Pylo\MCreator172\jdk64\"
C:\Pylo\MCreator172\forge>SET JAVA_EXE=%JAVA_HOME%\bin\java.exe
C:\Pylo\MCreator172\forge>SET PATH=%JAVA_HOME%\bin\;%PATH%
C:\Pylo\MCreator172\forge>gradlew -Dorg.gradle.jvmargs="-Xms1047m -Xmx2048m" build --stacktrace
To honour the JVM settings for this build a new JVM will be forked. Please consider using the daemon: http://gradle.org/docs/2.0/userguide/gradle_daemon.html.
****************************
 Powered By MCP:             
 http://modcoderpack.com/    
 Searge, ProfMobius, Fesh0r, 
 R4wk, ZeuX, IngisKahn, bspkrs
 MCP Data version : unknown
****************************
:compileApiJava UP-TO-DATE
:processApiResources UP-TO-DATE
:apiClasses UP-TO-DATE
:sourceMainJava
:compileJava
:processResources
:classes
:jar
:compileTestJava UP-TO-DATE
:processTestResources UP-TO-DATE
:testClasses UP-TO-DATE
:test UP-TO-DATE
:extractMcpData
:getVersionJson
   
Executing gradle command: build
Microsoft Windows [Versi¢n 6.3.9600]
(c) 2013 Microsoft Corporation. Todos los derechos reservados.
C:\Pylo\MCreator172>cd forge
C:\Pylo\MCreator172\forge>SET "JAVA_HOME=C:\Pylo\MCreator172\jdk64\"
C:\Pylo\MCreator172\forge>SET JAVA_EXE=%JAVA_HOME%\bin\java.exe
C:\Pylo\MCreator172\forge>SET PATH=%JAVA_HOME%\bin\;%PATH%
C:\Pylo\MCreator172\forge>gradlew -Dorg.gradle.jvmargs="-Xms1047m -Xmx2048m" build
To honour the JVM settings for this build a new JVM will be forked. Please consider using the daemon: http://gradle.org/docs/2.0/userguide/gradle_daemon.html.
:extractUserDev
:genSrgs SKIPPED
:reobf FAILED
FAILURE: Build failed with an exception.
* What went wrong:
Execution failed for task ':reobf'.
> MALFORMED
* Try:
Run with --info or --debug option to get more log output.
* Exception is:
org.gradle.api.tasks.TaskExecutionException: Execution failed for task ':reobf'.
   at org.gradle.api.internal.tasks.execution.ExecuteActionsTaskExecuter.executeActions(ExecuteActionsTaskExecuter.java:69)
   at org.gradle.api.internal.tasks.execution.ExecuteActionsTaskExecuter.execute(ExecuteActionsTaskExecuter.java:46)
   at org.gradle.api.internal.tasks.execution.PostExecutionAnalysisTaskExecuter.execute(PostExecutionAnalysisTaskExecuter.java:35)
   at org.gradle.api.internal.tasks.execution.SkipUpToDateTaskExecuter.execute(SkipUpToDateTaskExecuter.java:64)
   at org.gradle.api.internal.tasks.execution.ValidatingTaskExecuter.execute(ValidatingTaskExecuter.java:58)
   at org.gradle.api.internal.tasks.execution.SkipEmptySourceFilesTaskExecuter.execute(SkipEmptySourceFilesTaskExecuter.java:42)
   at org.gradle.api.internal.tasks.execution.SkipTaskWithNoActionsExecuter.execute(SkipTaskWithNoActionsExecuter.java:52)
   at org.gradle.api.internal.tasks.execution.SkipOnlyIfTaskExecuter.execute(SkipOnlyIfTaskExecuter.java:53)
   at org.gradle.api.internal.tasks.execution.ExecuteAtMostOnceTaskExecuter.execute(ExecuteAtMostOnceTaskExecuter.java:43)
   at org.gradle.api.internal.AbstractTask.executeWithoutThrowingTaskFailure(AbstractTask.java:296)
   at org.gradle.execution.taskgraph.AbstractTaskPlanExecutor$TaskExecutorWorker.executeTask(AbstractTaskPlanExecutor.java:79)
   at org.gradle.execution.taskgraph.AbstractTaskPlanExecutor$TaskExecutorWorker.processTask(AbstractTaskPlanExecutor.java:63)
   at org.gradle.execution.taskgraph.AbstractTaskPlanExecutor$TaskExecutorWorker.run(AbstractTaskPlanExecutor.java:51)
   at org.gradle.execution.taskgraph.DefaultTaskPlanExecutor.process(DefaultTaskPlanExecutor.java:23)
   at org.gradle.execution.taskgraph.DefaultTaskGraphExecuter.execute(DefaultTaskGraphExecuter.java:86)
   at org.gradle.execution.SelectedTaskExecutionAction.execute(SelectedTaskExecutionAction.java:29)
   at org.gradle.execution.DefaultBuildExecuter.execute(DefaultBuildExecuter.java:61)
   at org.gradle.execution.DefaultBuildExecuter.access$200(DefaultBuildExecuter.java:23)
   at org.gradle.execution.DefaultBuildExecuter$2.proceed(DefaultBuildExecuter.java:67)
   at org.gradle.execution.DryRunBuildExecutionAction.execute(DryRunBuildExecutionAction.java:32)
   at org.gradle.execution.DefaultBuildExecuter.execute(DefaultBuildExecuter.java:61)
   at org.gradle.execution.DefaultBuildExecuter.execute(DefaultBuildExecuter.java:54)
   at org.gradle.initialization.DefaultGradleLauncher.doBuildStages(DefaultGradleLauncher.java:148)
   at org.gradle.initialization.DefaultGradleLauncher.doBuild(DefaultGradleLauncher.java:105)
   at org.gradle.initialization.DefaultGradleLauncher.run(DefaultGradleLauncher.java:85)
   at org.gradle.launcher.exec.InProcessBuildActionExecuter$DefaultBuildController.run(InProcessBuildActionExecuter.java:81)
   at org.gradle.launcher.cli.ExecuteBuildAction.run(ExecuteBuildAction.java:33)
   at org.gradle.launcher.cli.ExecuteBuildAction.run(ExecuteBuildAction.java:24)
   at org.gradle.launcher.exec.InProcessBuildActionExecuter.execute(InProcessBuildActionExecuter.java:39)
   at org.gradle.launcher.daemon.server.exec.ExecuteBuild.doBuild(ExecuteBuild.java:45)
   at org.gradle.launcher.daemon.server.exec.BuildCommandOnly.execute(BuildCommandOnly.java:34)
   at org.gradle.launcher.daemon.server.exec.DaemonCommandExecution.proceed(DaemonCommandExecution.java:125)
   at org.gradle.launcher.daemon.server.exec.WatchForDisconnection.execute(WatchForDisconnection.java:35)
   at org.gradle.launcher.daemon.server.exec.DaemonCommandExecution.proceed(DaemonCommandExecution.java:125)
   at org.gradle.launcher.daemon.server.exec.ResetDeprecationLogger.execute(ResetDeprecationLogger.java:24)
   at org.gradle.launcher.daemon.server.exec.DaemonCommandExecution.proceed(DaemonCommandExecution.java:125)
   at org.gradle.launcher.daemon.server.exec.StartStopIfBuildAndStop.execute(StartStopIfBuildAndStop.java:33)
   at org.gradle.launcher.daemon.server.exec.DaemonCommandExecution.proceed(DaemonCommandExecution.java:125)
   at org.gradle.launcher.daemon.server.exec.ReturnResult.execute(ReturnResult.java:34)
   at org.gradle.launcher.daemon.server.exec.DaemonCommandExecution.proceed(DaemonCommandExecution.java:125)
   at org.gradle.launcher.daemon.server.exec.ForwardClientInput$2.call(ForwardClientInput.java:71)
   at org.gradle.launcher.daemon.server.exec.ForwardClientInput$2.call(ForwardClientInput.java:69)
   at org.gradle.util.Swapper.swap(Swapper.java:38)
   at org.gradle.launcher.daemon.server.exec.ForwardClientInput.execute(ForwardClientInput.java:69)
   at org.gradle.launcher.daemon.server.exec.DaemonCommandExecution.proceed(DaemonCommandExecution.java:125)
   at org.gradle.launcher.daemon.server.exec.LogToClient.doBuild(LogToClient.java:60)
   at org.gradle.launcher.daemon.server.exec.BuildCommandOnly.execute(BuildCommandOnly.java:34)
   at org.gradle.launcher.daemon.server.exec.DaemonCommandExecution.proceed(DaemonCommandExecution.java:125)
   at org.gradle.launcher.daemon.server.exec.EstablishBuildEnvironment.doBuild(EstablishBuildEnvironment.java:60)
   at org.gradle.launcher.daemon.server.exec.BuildCommandOnly.execute(BuildCommandOnly.java:34)
   at org.gradle.launcher.daemon.server.exec.DaemonCommandExecution.proceed(DaemonCommandExecution.java:125)
   at org.gradle.launcher.daemon.server.exec.StartBuildOrRespondWithBusy$1.run(StartBuildOrRespondWithBusy.java:45)
   at org.gradle.launcher.daemon.server.DaemonStateCoordinator.runCommand(DaemonStateCoordinator.java:184)
   at org.gradle.launcher.daemon.server.exec.StartBuildOrRespondWithBusy.doBuild(StartBuildOrRespondWithBusy.java:49)
   at org.gradle.launcher.daemon.server.exec.BuildCommandOnly.execute(BuildCommandOnly.java:34)
   at org.gradle.launcher.daemon.server.exec.DaemonCommandExecution.proceed(DaemonCommandExecution.java:125)
   at org.gradle.launcher.daemon.server.exec.HandleStop.execute(HandleStop.java:30)
   at org.gradle.launcher.daemon.server.exec.DaemonCommandExecution.proceed(DaemonCommandExecution.java:125)
   at org.gradle.launcher.daemon.server.exec.DaemonHygieneAction.execute(DaemonHygieneAction.java:39)
   at org.gradle.launcher.daemon.server.exec.DaemonCommandExecution.proceed(DaemonCommandExecution.java:125)
   at org.gradle.launcher.daemon.server.exec.CatchAndForwardDaemonFailure.execute(CatchAndForwardDaemonFailure.java:32)
   at org.gradle.launcher.daemon.server.exec.DaemonCommandExecution.proceed(DaemonCommandExecution.java:125)
   at org.gradle.launcher.daemon.server.exec.DefaultDaemonCommandExecuter.executeCommand(DefaultDaemonCommandExecuter.java:51)
   at org.gradle.launcher.daemon.server.DefaultIncomingConnectionHandler$ConnectionWorker.handleCommand(DefaultIncomingConnectionHandler.java:155)
   at org.gradle.launcher.daemon.server.DefaultIncomingConnectionHandler$ConnectionWorker.receiveAndHandleCommand(DefaultIncomingConnectionHandler.java:128)
   at org.gradle.launcher.daemon.server.DefaultIncomingConnectionHandler$ConnectionWorker.run(DefaultIncomingConnectionHandler.java:116)
   at org.gradle.internal.concurrent.DefaultExecutorFactory$StoppableExecutorImpl$1.run(DefaultExecutorFactory.java:64)
Caused by: java.lang.IllegalArgumentException: MALFORMED
   at net.md_5.specialsource.Jar.collectJarFiles(Jar.java:169)
   at net.md_5.specialsource.Jar.init(Jar.java:229)
   at net.md_5.specialsource.Jar.init(Jar.java:206)
   at net.minecraftforge.gradle.tasks.user.reobf.ObfArtifact.applySpecialSource(ObfArtifact.java:387)
   at net.minecraftforge.gradle.tasks.user.reobf.ObfArtifact.generate(ObfArtifact.java:350)
   at net.minecraftforge.gradle.tasks.user.reobf.ReobfTask.doTask(ReobfTask.java:317)
   at org.gradle.internal.reflect.JavaMethod.invoke(JavaMethod.java:63)
   at org.gradle.api.internal.project.taskfactory.AnnotationProcessingTaskFactory$StandardTaskAction.doExecute(AnnotationProcessingTaskFactory.java:218)
   at org.gradle.api.internal.project.taskfactory.AnnotationProcessingTaskFactory$StandardTaskAction.execute(AnnotationProcessingTaskFactory.java:211)
   at org.gradle.api.internal.project.taskfactory.AnnotationProcessingTaskFactory$StandardTaskAction.execute(AnnotationProcessingTaskFactory.java:200)
   at org.gradle.api.internal.AbstractTask$TaskActionWrapper.execute(AbstractTask.java:570)
   at org.gradle.api.internal.AbstractTask$TaskActionWrapper.execute(AbstractTask.java:553)
   at org.gradle.api.internal.tasks.execution.ExecuteActionsTaskExecuter.executeAction(ExecuteActionsTaskExecuter.java:80)
   at org.gradle.api.internal.tasks.execution.ExecuteActionsTaskExecuter.executeActions(ExecuteActionsTaskExecuter.java:61)
   ... 66 more
BUILD FAILED
Total time: 2 mins 19.928 secs
C:\Pylo\MCreator172\forge>