Execution failed for task ':extractUserdev'. (MCreator 1.9.1 for Minecraft 1.12.2)

Started by BlackNova on Sun, 10/20/2019 - 04:18

Topic category: Help with MCreator's application

Last seen on 07:41, 21. Oct 2019
Joined Apr 2019
User points:

Statistics:

  • Comments:
  • Forum topics:
  • Modifications:
  • Wiki pages:
Execution failed for task ':extractUserdev'. (MCreator 1.9.1 for Minecraft 1.12.2)
Sun, 10/20/2019 - 04:18

Executing gradle command: setupDecompWorkspace --refresh-dependencies
Build info: MCreator 1.9.1, 64-bit, 8060 MB, Windows 10 - cmd, JVM 1.8.0_222, JAVA_HOME: C:\Users\mkgpa\Downloads\MCreator 1.9.1 [1.12.2] Windows 64bit\MCreator191\jdk
C:\Users\mkgpa\MCreatorWorkspaces\myproject>gradlew -Dorg.gradle.java.home="C:/Users/mkgpa/Downloads/MCreator 1.9.1 [1.12.2] Windows 64bit/MCreator191/jdk" -Dorg.gradle.parallel=false -Dorg.gradle.jvmargs="-Xms625m -Xmx2048m" setupDecompWorkspace --refresh-dependencies
This mapping 'snapshot_20171003' was designed for MC 1.12! Use at your own peril.
:deobfCompileDummyTask
:deobfProvidedDummyTask
:getVersionJson
:extractUserdev FAILED
FAILURE: Build failed with an exception.
* What went wrong:
Execution failed for task ':extractUserdev'.
> Could not expand ZIP 'C:\Users\mkgpa\.mcreator\gradle\caches\modules-2\files-2.1\net.minecraftforge\forge\1.12.2-14.23.5.2768\68ca1280e543d8708e00b085a87d88595611d529\forge-1.12.2-14.23.5.2768-userdev.jar'.
* Try:
Run with --stacktrace option to get the stack trace. Run with --info or --debug option to get more log output. Run with --scan to get full insights.
* Get more help at https://help.gradle.org
BUILD FAILED in 22s
4 actionable tasks: 4 executed
C:\Users\mkgpa\MCreatorWorkspaces\myproject>
Task completed with return code 0 in 23420 milliseconds

 

 

Help me please <(' 3 ')>