Something wrong with my biome

Started by R6Gamer_07 on Sat, 02/27/2021 - 08:59

Topic category: Help with modding (Java Edition)

Last seen on 23:42, 13. Mar 2021
Joined Feb 2021
Points:

User statistics:

  • Modifications:
  • Forum topics:
  • Wiki pages:
  • Tracker tickets:
  • MCreator plugins:
  • Comments:
Something wrong with my biome
Sat, 02/27/2021 - 08:59

so ive been trying to do a dimention but evertime an eror pops up your workspace contains elements that dont compile and i tried everything bruh help also heres the error code

Executing Gradle task: build
Build info: MCreator 2021.1.03117 EAP (03117), forge-1.15.2, 64-bit, 6077 MB, Windows 10, JVM 1.8.0_275, JAVA_HOME: C:\Users\colin\Downloads\MCreatorEAP20211b03117\jdk
> Configure project :
New Dep: net.minecraftforge:forge:1.15.2-31.2.0_mapped_snapshot_20200514-1.15.1
> Task :compileJava FAILED
C:\Users\colin\MCreatorWorkspaces\kevins_mod_pack\src\main\java\net\mcreator\kevinsmodpack\world\biome\GalacticbiomeBiome.java:155: error: illegal start of expression || state.getBlock() == .getDefaultState().getBlock()
^
C:\Users\colin\MCreatorWorkspaces\kevins_mod_pack\src\main\java\net\mcreator\kevinsmodpack\world\biome\GalacticbiomeBiome.java:156: error: not a statement || state.getBlock() == GalaxyLeavesBlock.block.getDefaultState().getBlock()) {
^
C:\Users\colin\MCreatorWorkspaces\kevins_mod_pack\src\main\java\net\mcreator\kevinsmodpack\world\biome\GalacticbiomeBiome.java:156: error: ';' expected || state.getBlock() == GalaxyLeavesBlock.block.getDefaultState().getBlock()) {
^
C:\Users\colin\MCreatorWorkspaces\kevins_mod_pack\src\main\java\net\mcreator\kevinsmodpack\world\biome\GalacticbiomeBiome.java:171: error: illegal start of expression || state.getBlock() == .getDefaultState().getBlock()
^
C:\Users\colin\MCreatorWorkspaces\kevins_mod_pack\src\main\java\net\mcreator\kevinsmodpack\world\biome\GalacticbiomeBiome.java:172: error: not a statement || state.getBlock() == GalaxyLeavesBlock.block.getDefaultState().getBlock()){
^
C:\Users\colin\MCreatorWorkspaces\kevins_mod_pack\src\main\java\net\mcreator\kevinsmodpack\world\biome\GalacticbiomeBiome.java:172: error: ';' expected || state.getBlock() == GalaxyLeavesBlock.block.getDefaultState().getBlock()){
^
C:\Users\colin\MCreatorWorkspaces\kevins_mod_pack\src\main\java\net\mcreator\kevinsmodpack\world\biome\GalacticbiomeBiome.java:186: error: illegal start of expression setTreeBlockState(changedBlocks, world, pos, .getDefaultState(), bbox);
^
C:\Users\colin\MCreatorWorkspaces\kevins_mod_pack\src\main\java\net\mcreator\kevinsmodpack\world\biome\GalacticbiomeBiome.java:186: error: ';' expected setTreeBlockState(changedBlocks, world, pos, .getDefaultState(), bbox);
^
C:\Users\colin\MCreatorWorkspaces\kevins_mod_pack\src\main\java\net\mcreator\kevinsmodpack\world\biome\GalacticbiomeBiome.java:186: error: -> expected setTreeBlockState(changedBlocks, world, pos, .getDefaultState(), bbox);
^
C:\Users\colin\MCreatorWorkspaces\kevins_mod_pack\src\main\java\net\mcreator\kevinsmodpack\world\biome\GalacticbiomeBiome.java:186: error: ';' expected setTreeBlockState(changedBlocks, world, pos, .getDefaultState(), bbox);
^
C:\Users\colin\MCreatorWorkspaces\kevins_mod_pack\src\main\java\net\mcreator\kevinsmodpack\world\biome\GalacticbiomeBiome.java:189: error: illegal start of expression setTreeBlockState(changedBlocks, world, blockpos, .getDefaultState(), bbox);
^
C:\Users\colin\MCreatorWorkspaces\kevins_mod_pack\src\main\java\net\mcreator\kevinsmodpack\world\biome\GalacticbiomeBiome.java:189: error: ';' expected setTreeBlockState(changedBlocks, world, blockpos, .getDefaultState(), bbox);
^
C:\Users\colin\MCreatorWorkspaces\kevins_mod_pack\src\main\java\net\mcreator\kevinsmodpack\world\biome\GalacticbiomeBiome.java:189: error: -> expected setTreeBlockState(changedBlocks, world, blockpos, .getDefaultState(), bbox);
^
C:\Users\colin\MCreatorWorkspaces\kevins_mod_pack\src\main\java\net\mcreator\kevinsmodpack\world\biome\GalacticbiomeBiome.java:189: error: ';' expected setTreeBlockState(changedBlocks, world, blockpos, .getDefaultState(), bbox);
^
14 errors
FAILURE: Build failed with an exception.
* What went wrong:
Execution failed for task ':compileJava'.
> Compilation failed; see the compiler error output for details.
* Try:
Run with --stacktrace option to get the stack trace. Run with --info or --debug option to get more log output. Run with --scan to get full insights.
* Get more help at https://help.gradle.org
Deprecated Gradle features were used in this build, making it incompatible with Gradle 5.0.
Use '--warning-mode all' to show the individual deprecation warnings.
See https://docs.gradle.org/4.10.3/userguide/command_line_interface.html#se…
BUILD FAILED in 1s
1 actionable task: 1 executed
BUILD FAILED
Task completed in 3 seconds

Last seen on 23:42, 13. Mar 2021
Joined Feb 2021
Points:

User statistics:

  • Modifications:
  • Forum topics:
  • Wiki pages:
  • Tracker tickets:
  • MCreator plugins:
  • Comments:
huh? ye but i didnt delete…
Sat, 02/27/2021 - 23:30

huh? ye but i didnt delete any block