Error compiling new dimension

Started by Vishnya_0_ on Tue, 03/09/2021 - 20:05

Topic category: Troubleshooting, bugs, and solutions

Last seen on 12:45, 30. Mar 2021
Joined Mar 2021
Points:

User statistics:

  • Modifications:
  • Forum topics:
  • Wiki pages:
  • Tracker tickets:
  • MCreator plugins:
  • Comments:
Error compiling new dimension
Tue, 03/09/2021 - 20:05

Executing Gradle task: build
Build info: MCreator 2020.5.47520, forge-1.15.2, 64-bit, 8043 MB, Windows 10, JVM 1.8.0_265, JAVA_HOME: C:\Program Files\Pylo\MCreator\jdk
> Configure project :
New Dep: net.minecraftforge:forge:1.15.2-31.2.0_mapped_snapshot_20200514-1.15.1
> Task :compileJava FAILED
C:\Users\artem\MCreatorWorkspaces\darkrpg\src\main\java\net\mcreator\darkrpg\world\dimension\DarkForestDimension.java:144: error: illegal start of type }
^
C:\Users\artem\MCreatorWorkspaces\darkrpg\src\main\java\net\mcreator\darkrpg\world\dimension\DarkForestDimension.java:144: error: ';' expected }
^
C:\Users\artem\MCreatorWorkspaces\darkrpg\src\main\java\net\mcreator\darkrpg\world\dimension\DarkForestDimension.java:209: error: reached end of file while parsing }
^
3 errors
FAILURE: Build failed with an exception.
* What went wrong:
Execution failed for task ':compileJava'.
> Compilation failed; see the compiler error output for details.
* Try:
Run with --stacktrace option to get the stack trace. Run with --info or --debug option to get more log output. Run with --scan to get full insights.
* Get more help at https://help.gradle.org
Deprecated Gradle features were used in this build, making it incompatible with Gradle 5.0.
Use '--warning-mode all' to show the individual deprecation warnings.
See https://docs.gradle.org/4.10.3/userguide/command_line_interface.html#se…
BUILD FAILED in 4s
1 actionable task: 1 executed
BUILD FAILED
Task completed in 6989 milliseconds
Executing Gradle task: build
Build info: MCreator 2020.5.47520, forge-1.15.2, 64-bit, 8043 MB, Windows 10, JVM 1.8.0_265, JAVA_HOME: C:\Program Files\Pylo\MCreator\jdk
> Configure project :
New Dep: net.minecraftforge:forge:1.15.2-31.2.0_mapped_snapshot_20200514-1.15.1
> Task :compileJava FAILED
C:\Users\artem\MCreatorWorkspaces\darkrpg\src\main\java\net\mcreator\darkrpg\world\dimension\DarkForestDimension.java:144: error: illegal start of type }
^
C:\Users\artem\MCreatorWorkspaces\darkrpg\src\main\java\net\mcreator\darkrpg\world\dimension\DarkForestDimension.java:144: error: ';' expected }
^
C:\Users\artem\MCreatorWorkspaces\darkrpg\src\main\java\net\mcreator\darkrpg\world\dimension\DarkForestDimension.java:209: error: reached end of file while parsing }
^
3 errors
FAILURE: Build failed with an exception.
* What went wrong:
Execution failed for task ':compileJava'.
> Compilation failed; see the compiler error output for details.
* Try:
Run with --stacktrace option to get the stack trace. Run with --info or --debug option to get more log output. Run with --scan to get full insights.
* Get more help at https://help.gradle.org
Deprecated Gradle features were used in this build, making it incompatible with Gradle 5.0.
Use '--warning-mode all' to show the individual deprecation warnings.
See https://docs.gradle.org/4.10.3/userguide/command_line_interface.html#se…
BUILD FAILED in 4s
1 actionable task: 1 executed
BUILD FAILED
Task completed in 6989 milliseconds
 

 

 

 

I have already tried to fix the error using the ways from the forum. Nothing helped. 

Last seen on 02:37, 20. Nov 2021
Joined Sep 2020
Points:

User statistics:

  • Modifications:
  • Forum topics:
  • Wiki pages:
  • Tracker tickets:
  • MCreator plugins:
  • Comments:
It appears that you are…
Wed, 03/10/2021 - 20:46

It appears that you are missing a semicolon and a open brace meaning that the generator has reached the end of the statement without any signal that it should stop it keeps parsing or I could be completely wrong because I normaly use js prossesing.